1,2,3-Metheno-1H-cycloprop[cd]indene,octahydro-
- Formula: C10H12
- Molecular weight: 132.2023
- IUPAC Standard InChIKey: HINXRGAQSXIQPJ-UHFFFAOYSA-N
- CAS Registry Number: 28339-41-5
- Chemical structure:
View 3d structure (requires JavaScript / HTML 5) - Permanent link for this species. Use this link for bookmarking this species for future reference.

Gas phase ion energetics data

Data compiled by: Sharon G. Lias, Rhoda D. Levin, and Sherif A. Kafafi
Ionization energy determinations
IE (eV) | Method | Reference | Comment |
---|---|---|---|
9.08 ± 0.02 | PE | Martin, Heller, et al., 1974 | Vertical value |

References

Martin, Heller, et al., 1974
Martin, H.-D.; Heller, C.; Werp, J.,
Bishomofulvenkonjugation. Photoelektronenspektren und elektronenstruktur homologer quadricyclane,
Chem. Ber., 1974, 107, 1393. [all data]