6,7-Dioxabicyclo[3.2.2]nonane
- Formula: C7H12O2
- Molecular weight: 128.1690
- IUPAC Standard InChIKey: XXNKHBFCIGOWEC-UHFFFAOYSA-N
- CAS Registry Number: 283-35-2
- Chemical structure:
View 3d structure (requires JavaScript / HTML 5) - Other names: 6,7-Dioxabicyclo(3,2,2)nonane

Gas phase ion energetics data

Data compiled by: Sharon G. Lias, Rhoda D. Levin, and Sherif A. Kafafi
Ionization energy determinations
IE (eV) | Method | Reference | Comment |
---|---|---|---|
8.97 | PE | Coughlin, Brown, et al., 1979 | Vertical value |

References

Coughlin, Brown, et al., 1979
Coughlin, D.J.; Brown, R.S.; Salomon, R.G.,
The prostaglandin endoperoxide nucleus and related bicyclic peroxides. Synthetic and spectroscopic studies,
J. Am. Chem. Soc., 1979, 101, 1533. [all data]