Benzenemethanamine,dimethyl-
- Formula: C9H13N
- Molecular weight: 135.2062
- IUPAC Standard InChIKey: UKLRWOHZBISUMI-UHFFFAOYSA-N
- CAS Registry Number: 28262-13-7
- Chemical structure:
View 3d structure (requires JavaScript / HTML 5) - Permanent link for this species. Use this link for bookmarking this species for future reference.

Gas phase ion energetics data

Data compiled by: Sharon G. Lias, Rhoda D. Levin, and Sherif A. Kafafi
Ionization energy determinations
IE (eV) | Method | Reference |
---|---|---|
7.69 | PI | Akopyan, Vilesov, et al., 1975 |
Appearance energy determinations
Ion | AE (eV) | Other Products | Method | Reference | Comment |
---|---|---|---|---|---|
C2H6N+ | 9.62 | C6H5CH2 | PI | Akopyan, Vilesov, et al., 1975 | |
C3H8N+ | 9.52 | C6H5 | PI | Akopyan, Vilesov, et al., 1975 | |
C7H7+ | 9.62 | C2H6N | PI | Akopyan, Vilesov, et al., 1975 | |
C8H10N+ | 9.57 | H | PI | Akopyan, Vilesov, et al., 1975 |

References

Akopyan, Vilesov, et al., 1975
Akopyan, M.E.; Vilesov, F.I.; Loginov, Y.V.,
Photoionization of amines and the monomolecular decomposition of excited molecular ions,
Khim. Vys. Energ., 1975, 9, 327. [all data]