exo-Ttricyclo[5.2.1.0(2,6)]decane
- Formula: C10H16
- Molecular weight: 136.2340
- IUPAC Standard InChIKey: HFDBLHGEKMWGRC-LVEBTZEWSA-N
- CAS Registry Number: 2825-82-3
- Chemical structure:
View 3d structure (requires JavaScript / HTML 5) - Stereoisomers:
- Other names: Tricyclo[5.2.1.02,6]decane; 4,7-Methano-1H-indene, octahydro-, (3aα,4β,7β,7aα)-; 4,7-Methanoindan, hexahydro-, exo-; exo-Hexahydro-4,7-methanoindan; JP-10; exo-Tetrahydrobicyclopentadiene; exo-Tetrahydrodi(cyclopentadiene); exo-Tricyclo(5.2.1.02,6)decane; exo-Trimethylenenorbornane; exo-5,6-Trimethylenenorbornane; exo-Octahydro-4,7-methano-1H-indene; exo-3,4,8,9-Tetrahydrodicyclopentadiene; endo-Octahydro-4,7-methano-1H-indene; (3aα,4β,7β,7aα)-octahydro-4,7-methano-1H-indene

Condensed phase thermochemistry data

Data compiled by: Eugene S. Domalski and Elizabeth D. Hearing
Constant pressure heat capacity of liquid
Cp,liquid (J/mol*K) | Temperature (K) | Reference | Comment |
---|---|---|---|
213.87 | 298.15 | Good, Thomas, et al., 1980 | T = 260 to 465 K. Equation only. Cp calculated from equation Cp (cal/g*K) = 0.10423 + 0.76872x10-3T + 0.46992x10-6T2 (260 to 465 K). |
236.6 | 298.15 | Smith and Good, 1979 | Cp given as 0.415 cal/g*K. |
236.50 | 298.15 | Good, Scott, et al., 1978 | T = 275 to 365 K. Equation only. Cp calculated from equation. Cs = 0.046061 + 0.0012371 T cal/g*K (275 to 365 K). |

Phase change data

Data compiled by: William E. Acree, Jr., James S. Chickos
Enthalpy of fusion
ΔfusH (kJ/mol) | Temperature (K) | Method | Reference |
---|---|---|---|
1.2 | 183.2 | DSC | Chickos, Hillesheim, et al., 2002 |

Gas phase ion energetics data

Data compiled by: Sharon G. Lias, Rhoda D. Levin, and Sherif A. Kafafi
Ionization energy determinations
IE (eV) | Method | Reference |
---|---|---|
9.35 ± 0.05 | PI | Fedorova, Denisov, et al., 1973 |
Appearance energy determinations
Ion | AE (eV) | Other Products | Method | Reference | Comment |
---|---|---|---|---|---|
C5H7+ | 10.0 ± 0.1 | ? | PI | Fedorova, Denisov, et al., 1973 | |
C5H9+ | 10.5 ± 0.1 | ? | PI | Fedorova, Denisov, et al., 1973 | |
C6H8+ | 9.9 ± 0.1 | ? | PI | Fedorova, Denisov, et al., 1973 | |
C7H11+ | 9.9 ± 0.1 | ? | PI | Fedorova, Denisov, et al., 1973 | |
C8H12+ | 10.5 ± 0.1 | ? | PI | Fedorova, Denisov, et al., 1973 | |
C9H13+ | 9.8 ± 0.1 | CH3 | PI | Fedorova, Denisov, et al., 1973 |

References

Good, Thomas, et al., 1980
Good, W.D.; Thomas, R.H.P.; Gammon, B.E.; Lee-Bechtold, S.; Callanan, J.E.; Smith, N.K.,
Thermodynamics of organic compounds, 1980, U. [all data]
Smith and Good, 1979
Smith, N.K.; Good, W.D.,
Enthalpies of combustion of ramjet fuels,
Am. Inst. Aeronaut. Astronaut. (AIAA), 1979, 17, 905-907. [all data]
Good, Scott, et al., 1978
Good, W.D.; Scott, D.W.; Smith, N.K.; Lee-Bechtold, S.; Osborn, A.G.,
Thermodynamics of Organic Compounds,
U.S. Dept. of Energy Report, 1978, AFOSR-TR-79-0197, 20pp. [all data]
Chickos, Hillesheim, et al., 2002
Chickos, James S.; Hillesheim, Dorothea; Nichols, Gary; Zehe, Michael J.,
The enthalpies of vaporization and sublimation of exo- and endo-tetrahydrodicyclopentadienes at T=298.15K,
The Journal of Chemical Thermodynamics, 2002, 34, 10, 1647-1658, https://doi.org/10.1016/S0021-9614(02)00229-X
. [all data]
Fedorova, Denisov, et al., 1973
Fedorova, M.S.; Denisov, Y.V.; Poptapov, V.K.,
Mass-spectrometric study of the photoionisation processes of tricyclo[5,2,1,02,6] decane and its alkyl derivatives,
Russ. J. Phys. Chem., 1973, 47, 1498. [all data]