Phenol,2,6-diiodo-,acetate
- Formula: C8H6I2O2
- Molecular weight: 387.9410
- IUPAC Standard InChIKey: JCSYMLVRRUYACV-UHFFFAOYSA-N
- CAS Registry Number: 28165-73-3
- Chemical structure:
View 3d structure (requires JavaScript / HTML 5) - Permanent link for this species. Use this link for bookmarking this species for future reference.

Gas phase ion energetics data

Data compiled by: Sharon G. Lias, Rhoda D. Levin, and Sherif A. Kafafi
Ionization energy determinations
IE (eV) | Method | Reference |
---|---|---|
8.07 ± 0.03 | EI | Benezra and Bursey, 1972 |
Appearance energy determinations
Ion | AE (eV) | Other Products | Method | Reference | Comment |
---|---|---|---|---|---|
C2H3O+ | 12.02 ± 0.03 | ? | EI | Benezra and Bursey, 1972 | |
C6H4OI2+ | 9.18 ± 0.03 | CH2=C=O | EI | Benezra and Bursey, 1972 |

References

Benezra and Bursey, 1972
Benezra, S.A.; Bursey, M.M.,
ortho-Effects in mass spectra. Alteration of the molecular-ion energy distribution in disubstituted acetanilides,
Z. Naturforsch. A:, 1972, 27, 670. [all data]