Phenol, 2,6-dichloro-, acetate
- Formula: C8H6Cl2O2
- Molecular weight: 205.038
- IUPAC Standard InChIKey: YNSMUWSJRXDNLN-UHFFFAOYSA-N
- CAS Registry Number: 28165-71-1
- Chemical structure:
View 3d structure (requires JavaScript / HTML 5) - Other names: 2,6-Dichlorophenyl acetate; Acetic acid, 2,6-dichlorophenyl ester; 2,6-Dichlorophenol, acetate

Gas phase ion energetics data

Data compiled by: Sharon G. Lias, Rhoda D. Levin, and Sherif A. Kafafi
Ionization energy determinations
IE (eV) | Method | Reference |
---|---|---|
8.68 ± 0.03 | EI | Benezra and Bursey, 1972 |
Appearance energy determinations
Ion | AE (eV) | Other Products | Method | Reference | Comment |
---|---|---|---|---|---|
C2H3O+ | 12.09 ± 0.03 | ? | EI | Benezra and Bursey, 1972 | |
C6H4OCl2+ | 9.88 ± 0.03 | CH2=C=O | EI | Benezra and Bursey, 1972 |

Kovats' RI, non-polar column, isothermal

View large format table.

Column type Active phase Temperature (C) I Reference Comment
CapillarySE-30160.1296.Evans and Haken, 1989Column length: 25. m; Column diameter: 0.32 mm
CapillarySE-30180.1330.Tarjan, Nyiredy, et al., 1989
CapillaryOV-101160.1296.Haken and Korhonen, 1983N2; Column length: 25. m; Column diameter: 0.22 mm
CapillaryOV-101180.1330.Haken and Korhonen, 1983N2; Column length: 25. m; Column diameter: 0.22 mm

Kovats' RI, polar column, isothermal

View large format table.

Column type Active phase Temperature (C) I Reference Comment
CapillaryOV-351160.1971.Evans and Haken, 1989Column length: 25. m; Column diameter: 0.32 mm

Van Den Dool and Kratz RI, non-polar column, temperature ramp

View large format table.

Column type Active phase I Reference Comment
CapillaryVF-5MS1342.Todua, 201130. m/0.25 mm/0.25 μm, He; Tstart: 60. C; Tend: 270. C

References

Benezra and Bursey, 1972
Benezra, S.A.; Bursey, M.M.,
ortho-Effects in mass spectra. Alteration of the molecular-ion energy distribution in disubstituted acetanilides,
Z. Naturforsch. A:, 1972, 27, 670. [all data]