Silane, ethyl-
- Formula: C2H8Si
- Molecular weight: 60.1704
- IUPAC Standard InChIKey: KCWYOFZQRFCIIE-UHFFFAOYSA-N
- CAS Registry Number: 2814-79-1
- Chemical structure:
View 3d structure (requires JavaScript / HTML 5) - Other names: Ethylsilane; 1-Silapropane; C2H5SiH3

Gas phase ion energetics data

Data compiled as indicated in comments:
RDSH - Henry M. Rosenstock, Keith Draxl, Bruce W. Steiner, and John T. Herron
Ionization energy determinations
IE (eV) | Method | Reference | Comment |
---|---|---|---|
10.18 ± 0.05 | EI | Steele, Nichols, et al., 1962 | RDSH |
Appearance energy determinations
Ion | AE (eV) | Other Products | Method | Reference | Comment |
---|---|---|---|---|---|
C2H5+ | 12.6 ± 0.2 | ? | EI | Steele, Nichols, et al., 1962 | RDSH |
SiH2+ | 12.0 ± 0.1 | C2H6 | EI | Steele, Nichols, et al., 1962 | RDSH |
SiH3+ | 12.8 ± 0.2 | C2H5 | EI | Steele, Nichols, et al., 1962 | RDSH |

References

Steele, Nichols, et al., 1962
Steele, W.C.; Nichols, L.D.; Stone, F.G.A.,
The determination of silicon-carbon and silicon-hydrogen bond dissociation energies by electron impact,
J. Am. Chem. Soc., 1962, 84, 4441. [all data]