2-Octyne
- Formula: C8H14
- Molecular weight: 110.1968
- IUPAC Standard InChIKey: QCQALVMFTWRCFI-UHFFFAOYSA-N
- CAS Registry Number: 2809-67-8
- Chemical structure:
View 3d structure (requires JavaScript / HTML 5) - Other names: n-C5H11C≡CCH3; oct-2-yne

Gas phase thermochemistry data

Data compiled by: Hussein Y. Afeefy, Joel F. Liebman, and Stephen E. Stein
Quantity | Value | Units | Method | Reference | Comment |
---|---|---|---|---|---|
ΔfH°gas | 63.8 ± 1.5 | kJ/mol | Chyd | Rogers, Dagdagan, et al., 1979 |

Phase change data

Data compiled as indicated in comments:
BS - Robert L. Brown and Stephen E. Stein
TRC - Thermodynamics Research Center, NIST Boulder Laboratories, Chris Muzny director
AC - William E. Acree, Jr., James S. Chickos
Quantity | Value | Units | Method | Reference | Comment |
---|---|---|---|---|---|
Tboil | 410. ± 2. | K | AVG | N/A | Average of 13 values; Individual data points |
Quantity | Value | Units | Method | Reference | Comment |
Tfus | 211.44 | K | N/A | Miller, Greenlee, et al., 1954 | Uncertainty assigned by TRC = 2. K; TRC |
Tfus | 211.55 | K | N/A | Henne and Greenlee, 1945 | Uncertainty assigned by TRC = 0.2 K; TRC |
Tfus | 211.15 | K | N/A | Campbell and Eby, 1941 | Uncertainty assigned by TRC = 1.5 K; TRC |
Quantity | Value | Units | Method | Reference | Comment |
ΔvapH° | 44.52 | kJ/mol | N/A | Majer and Svoboda, 1985 | |
ΔvapH° | 44.5 ± 0.1 | kJ/mol | C | Hallman, Stephenson, et al., 1983 | AC |
Enthalpy of vaporization
ΔvapH (kJ/mol) | Temperature (K) | Method | Reference | Comment |
---|---|---|---|---|
39.9 | 383. | A | Stephenson and Malanowski, 1987 | Based on data from 368. to 412. K. See also Eisen and Orav, 1970 and Boublik, Fried, et al., 1984.; AC |
37.26 | 410.7 | N/A | Majer and Svoboda, 1985 |

Reaction thermochemistry data

Data compiled by: Hussein Y. Afeefy, Joel F. Liebman, and Stephen E. Stein
Individual Reactions
By formula: 2H2 + C8H14 = C8H18
Quantity | Value | Units | Method | Reference | Comment |
---|---|---|---|---|---|
ΔrH° | -272.4 ± 0.46 | kJ/mol | Chyd | Rogers, Dagdagan, et al., 1979 | liquid phase; solvent: Hexane |

Gas phase ion energetics data

Data evaluated as indicated in comments:
L - Sharon G. Lias
Data compiled as indicated in comments:
LLK - Sharon G. Lias, Rhoda D. Levin, and Sherif A. Kafafi
Quantity | Value | Units | Method | Reference | Comment |
---|---|---|---|---|---|
IE (evaluated) | 9.31 ± 0.01 | eV | N/A | N/A | L |
Ionization energy determinations
IE (eV) | Method | Reference | Comment |
---|---|---|---|
9.31 ± 0.02 | PI | Rang and Martinson, 1978 | LLK |
9.302 ± 0.005 | PE | Carlier, Dubois, et al., 1975 | LLK |
Appearance energy determinations
Ion | AE (eV) | Other Products | Method | Reference | Comment |
---|---|---|---|---|---|
C6H9+ | 9.4 | C2H5 | EI | Wagner-Redeker, Levsen, et al., 1981 | LLK |
C7H11+ | 9.5 | CH3 | EI | Wagner-Redeker, Levsen, et al., 1981 | LLK |

Kovats' RI, non-polar column, isothermal

Column type | Active phase | Temperature (C) | I | Reference | Comment |
---|---|---|---|---|---|
Capillary | Squalane | 70. | 843.45 | Soják, 2004 | H2 |
Capillary | Squalane | 70. | 843.46 | Soják, 2004 | N2 |
Capillary | Squalane | 70. | 843.6 | Soják, 2004 | N2 |
Packed | SE-30 | 120. | 854. | Kowalski, 1992 | He, Gas Chrom Q (100-120 mesh); Column length: 0.25 m |
Capillary | Squalane | 80. | 842. | Soják, Farkas, et al., 1991 | 107. m/0.25 mm/0.40 μm, H2 |
Capillary | OV-101 | 110. | 865. | Kuningas, Rang, et al., 1990 | He; Column length: 50. m; Column diameter: 0.25 mm |
Packed | OV-101 | 150. | 858.9 | Maeck, Touabet, et al., 1989 | N2, Chromosorb G HP; Column length: 2. m |
Packed | OV-101 | 120. | 867. | Fernández-Sánchez, Fernández-Torres, et al., 1987 | N2, Chromosorb W AW DMCS (80-100 mesh); Column length: 2. m |
Packed | Squalane | 80. | 842. | Kersten and Poole, 1987 | N2; Column length: 3.5 m |
Packed | OV-1 | 120. | 859. | Betts, 1986 | N2; Column length: 1.5 m |
Packed | SE-30 | 120. | 860. | Betts, 1986 | N2; Column length: 1. m |
Packed | SP-2100 | 120. | 860. | Betts, 1986 | N2; Column length: 1. m |
Packed | OV-1 | 120. | 864. | Valko, Papp, et al., 1984 | Gas Chrom Q; Column length: 2. m |
Capillary | Squalane | 50. | 845.2 | Welsch, Engewald, et al., 1978 | Column length: 80. m; Column diameter: 0.23 mm |
Capillary | Squalane | 100. | 842. | Rang, Kuningas, et al., 1976 | N2; Column length: 100. m; Column diameter: 0.25 mm |
Capillary | Squalane | 110. | 841. | Rang, Kuningas, et al., 1976 | N2; Column length: 100. m; Column diameter: 0.25 mm |
Capillary | Squalane | 120. | 841. | Rang, Kuningas, et al., 1976 | N2; Column length: 100. m; Column diameter: 0.25 mm |
Capillary | Squalane | 130. | 840. | Rang, Kuningas, et al., 1976 | N2; Column length: 100. m; Column diameter: 0.25 mm |
Capillary | Squalane | 90. | 842. | Rang, Kuningas, et al., 1976 | N2; Column length: 100. m; Column diameter: 0.25 mm |
Capillary | Squalane | 80. | 845. | Orav and Eisen, 1972 | Column length: 80. m; Column diameter: 0.25 mm |

Kovats' RI, polar column, isothermal

Column type | Active phase | Temperature (C) | I | Reference | Comment |
---|---|---|---|---|---|
Capillary | PEG 4000 | 110. | 1065. | Rang, Orav, et al., 1988 | |
Capillary | PEG 4000 | 60. | 1063. | Rang, Orav, et al., 1988 | |
Capillary | PEG 4000 | 80. | 1064. | Rang, Orav, et al., 1988 | |
Packed | Carbowax 20M | 80. | 1054. | Kersten and Poole, 1987 | N2, Chromosorb W-AW; Column length: 3.5 m |
Packed | PEG-20M | 120. | 1041. | Betts, 1986 | Column length: 1. m |
Capillary | PEG 4000 | 70. | 1079. | Orav and Eisen, 1972 | Column length: 80. m; Column diameter: 0.25 mm |

Normal alkane RI, non-polar column, custom temperature program

Column type | Active phase | I | Reference | Comment |
---|---|---|---|---|
Capillary | SPB-1 | 867. | Flanagan, Streete, et al., 1997 | 60. m/0.53 mm/5. μm, He; Program: 40C(6min) => 5C/min => 80C => 10C/min => 200C |
Capillary | SPB-1 | 867. | Strete, Ruprah, et al., 1992 | 60. m/0.53 mm/5.0 μm, Helium; Program: 40 0C (6 min) 5 0C/min -> 80 0C 10 0C/min -> 200 0C |
Capillary | SPB-1 | 870. | Strete, Ruprah, et al., 1992 | 60. m/0.53 mm/5.0 μm, Helium; Program: not specified |
Capillary | OV-1 | 870. | Ramsey and Flanagan, 1982 | Program: not specified |

Normal alkane RI, polar column, isothermal

Column type | Active phase | Temperature (C) | I | Reference | Comment |
---|---|---|---|---|---|
Packed | PEG | 100. | 1037. | Dowling, Evans, et al., 1990 | Phasesep W (10 %) |
Packed | PEG | 100. | 1059. | Dowling, Evans, et al., 1990 | Phasesep W (10 %) |
Packed | PEG | 100. | 1079. | Dowling, Evans, et al., 1990 | Phasesep W (10 %) |

Normal alkane RI, polar column, custom temperature program

Column type | Active phase | I | Reference | Comment |
---|---|---|---|---|
Capillary | Carbowax 20M | 1040. | Ramsey and Flanagan, 1982 | Program: not specified |

References

Rogers, Dagdagan, et al., 1979
Rogers, D.W.; Dagdagan, O.A.; Allinger, N.L.,
Heats of hydrogenation and formation of linear alkynes and a molecular mechanics interpretation,
J. Am. Chem. Soc., 1979, 101, 671-676. [all data]
Miller, Greenlee, et al., 1954
Miller, H.M.; Greenlee, K.W.; Derfer, J.M.; Boord, C.E.,
J. Org. Chem., 1954, 19, 1882. [all data]
Henne and Greenlee, 1945
Henne, A.L.; Greenlee, K.W.,
Preparation and Physical Constants of Acetylenic Compounds,
J. Am. Chem. Soc., 1945, 67, 484-5. [all data]
Campbell and Eby, 1941
Campbell, K.N.; Eby, L.T.,
The Reduction of Multiple Carbon-Carbon Bonds III. Further Studies on the Preparation of Olefins from Acetylenes,
J. Am. Chem. Soc., 1941, 63, 2683. [all data]
Majer and Svoboda, 1985
Majer, V.; Svoboda, V.,
Enthalpies of Vaporization of Organic Compounds: A Critical Review and Data Compilation, Blackwell Scientific Publications, Oxford, 1985, 300. [all data]
Hallman, Stephenson, et al., 1983
Hallman, John H.; Stephenson, W. Kirk; Fuchs, Richard,
Hydrogen bonding and other polar interactions of 1-, 2-, and 4-octyne with organic solvents,
Can. J. Chem., 1983, 61, 9, 2044-2047, https://doi.org/10.1139/v83-353
. [all data]
Stephenson and Malanowski, 1987
Stephenson, Richard M.; Malanowski, Stanislaw,
Handbook of the Thermodynamics of Organic Compounds, 1987, https://doi.org/10.1007/978-94-009-3173-2
. [all data]
Eisen and Orav, 1970
Eisen, O.; Orav, A.,
Eesti NSV Tead. Akad. Toim. Keem. Geol., 1970, 19, 3, 202. [all data]
Boublik, Fried, et al., 1984
Boublik, T.; Fried, V.; Hala, E.,
The Vapour Pressures of Pure Substances: Selected Values of the Temperature Dependence of the Vapour Pressures of Some Pure Substances in the Normal and Low Pressure Region, 2nd ed., Elsevier, New York, 1984, 972. [all data]
Rang and Martinson, 1978
Rang, S.; Martinson, E.,
Ionization potentials of unsaturated hydrocarbons. 3. n-Alkyunes C8-C12.,
Eesti. NSV Tead. Akad. Toim. Keem., 1978, 44. [all data]
Carlier, Dubois, et al., 1975
Carlier, P.; Dubois, J.E.; Masclet, P.; Mouvier, G.,
Spectres de photoelectrons des alcynes,
J. Electron Spectrosc. Relat. Phenom., 1975, 7, 55. [all data]
Wagner-Redeker, Levsen, et al., 1981
Wagner-Redeker, W.; Levsen, K.; Schwarz, H.; Zummack, W.,
Gaseous alkyne ions,
J. Am. Chem. Soc., 1981, 16, 361. [all data]
Soják, 2004
Soják, L.,
Separation and identification of isomeric hydrocarbons by capillary gas chromatography and hyphenated spectrometric techniques,
Petroleum Coal, 2004, 46, 3, 1-35. [all data]
Kowalski, 1992
Kowalski, W.J.,
Free radical crosslinking of the gas chromatographic stationary phase containing europium chelates,
Chromatographia, 1992, 34, 5-8, 266-268, https://doi.org/10.1007/BF02268356
. [all data]
Soják, Farkas, et al., 1991
Soják, L.; Farkas, P.; Ostrovský, I.; Janák, J.; Chrétien, J.R.,
Capillary gas chromatography of C5 - C13 branched alkynes on squalane and liquid crystal stationary phases,
J. Chromatogr., 1991, 557, 241-253, https://doi.org/10.1016/S0021-9673(01)87136-3
. [all data]
Kuningas, Rang, et al., 1990
Kuningas, K.; Rang, S.; Kailas, T.,
Relationship between the structure and retention of n-alkenes and n-alkynes on silicone phases,
J. Chromatogr., 1990, 520, 137-148, https://doi.org/10.1016/0021-9673(90)85094-C
. [all data]
Maeck, Touabet, et al., 1989
Maeck, M.; Touabet, A.; Badjah Hadj Ahmed, A.Y.; Meklati, B.Y.,
A numerical interpolation of Kováts indices without dead time correction,
Chromatographia, 1989, 27, 5/6, 205-208, https://doi.org/10.1007/BF02260447
. [all data]
Fernández-Sánchez, Fernández-Torres, et al., 1987
Fernández-Sánchez, E.; Fernández-Torres, A.; García-Domínguez, J.A.; García-Muñoz, J.; Menéndez, V.; Molera, M.J.; Santiuste, J.M.; Pertierra-Rimada, E.,
Mixed stationary phases in gas-liquid chromatography. Partition coefficients and retention indices in OV-101-OV-25, OV-101-Carbowax 20M and OV-225-SP-2340 mixtures,
J. Chromatogr., 1987, 410, 13-29, https://doi.org/10.1016/S0021-9673(00)90031-1
. [all data]
Kersten and Poole, 1987
Kersten, B.R.; Poole, C.F.,
Influence of concurrent retention mechanisms on the determination of stationary phase selectivity in gas chromatography,
J. Chromatogr., 1987, 399, 1-31, https://doi.org/10.1016/S0021-9673(00)96108-9
. [all data]
Betts, 1986
Betts, T.J.,
Triangular Characterization of Gas Chromatographic Stationary Phases,
J. Chromatogr., 1986, 354, 1-6, https://doi.org/10.1016/S0021-9673(01)87005-9
. [all data]
Valko, Papp, et al., 1984
Valko, K.; Papp, O.; Darvas, F.,
Selection of Gas Chromatographic Stationary Phase Pairs for Characterization of the 1-Octanol-Water Partition Coefficient,
J. Chromatogr., 1984, 301, 355-364, https://doi.org/10.1016/S0021-9673(01)89210-4
. [all data]
Welsch, Engewald, et al., 1978
Welsch, Th.; Engewald, W.; Berger, P.,
IX. Das gas-chromatographische Retentionsverhalten isomerer Octine and Octadiine,
Chromatographia, 1978, 11, 1, 5-9, https://doi.org/10.1007/BF02262945
. [all data]
Rang, Kuningas, et al., 1976
Rang, S.; Kuningas, K.; Orav, A.; Eisen, O.,
Capillary gas chromatography of n-alkynes. I. Retention indices,
J. Chromatogr., 1976, 119, 451-460, https://doi.org/10.1016/S0021-9673(00)86807-7
. [all data]
Orav and Eisen, 1972
Orav, A.; Eisen, O.,
The retention indexes for alkenes, alkynes and cyclenes on capillary columns,
Izv. Akad. Nauk Est. SSR, Khim. Geol., 1972, 21, 1, 39-47. [all data]
Rang, Orav, et al., 1988
Rang, S.A.; Orav, A.E.; Kuningas, K.R.; Meister, A.E.; Strense, T.V.; Eisen, O.G.,
Gas-Chromatographic Characteristics of unsaturated hydrocarbons, Academy of Sciences of Estonia SSR, Tallinn, Estonia SSR, 1988, 208. [all data]
Tello, Lebron-Aguilar, et al., 2009
Tello, A.M.; Lebron-Aguilar, R.; Quintanilla-Lopez, J.E.; Santiuste, J.M.,
Isothermal retention indices on poly93-cyanopropylmethyl)siloxane stationary phases,
J. Chromatogr. A, 2009, 1216, 10, 1630-1639, https://doi.org/10.1016/j.chroma.2008.10.025
. [all data]
Lebrón-Aguilar, Quintanilla-López, et al., 2007
Lebrón-Aguilar, R.; Quintanilla-López, J.E.; Tello, A.M.; Santiuste, J.M.,
Isothermal retention indices on poly (3,3,3-trifluoropropylmethylsiloxane) stationary phases,
J. Chromatogr. A, 2007, 1160, 1-2, 276-288, https://doi.org/10.1016/j.chroma.2007.05.025
. [all data]
Flanagan, Streete, et al., 1997
Flanagan, R.J.; Streete, P.J.; Ramsey, J.D.,
Volatile Substance Abuse, UNODC Technical Series, No 5, United Nations, Office on Drugs and Crime, Vienna International Centre, PO Box 500, A-1400 Vienna, Austria, 1997, 56, retrieved from http://www.odccp.org/pdf/technicalseries1997-01-011.pdf. [all data]
Strete, Ruprah, et al., 1992
Strete, P.J.; Ruprah, M.; Ramsey, J.D.; Flanagan, R.J.,
Detection and identification of volatile substances by headspace capillary gas chromatography to aid the diagnosis of acute poisoning,
Analyst, 1992, 117, 7, 1111-1127, https://doi.org/10.1039/an9921701111
. [all data]
Ramsey and Flanagan, 1982
Ramsey, J.D.; Flanagan, R.J.,
Detection and Identification of Volatile Organic Compounds in Blood by Headspace Gas Chromatography as an Aid to the Diagnosis of Solvent Abuse,
J. Chromatogr., 1982, 240, 2, 423-444, https://doi.org/10.1016/S0021-9673(00)99622-5
. [all data]
Dowling, Evans, et al., 1990
Dowling, J.J.; Evans, M.B.; Haken, J.K.,
Gas-liquid chromatography in qualitative analysis. XVIII. Study of the dependence of the retention behavior of polyoxyethylene glycol columns on the nature of the support and phase loading,
J. Chromatogr., 1990, 500, 355-365, https://doi.org/10.1016/S0021-9673(00)96077-1
. [all data]