3-Hexen-1-yne
- Formula: C6H8
- Molecular weight: 80.1277
- IUPAC Standard InChIKey: CLFYLNSQRWCJAY-AATRIKPKSA-N
- CAS Registry Number: 2806-56-6
- Chemical structure:
View 3d structure (requires JavaScript / HTML 5) - Other names: 3-Hex-3-en-1-yne

Phase change data

Data compiled by: Thermodynamics Research Center, NIST Boulder Laboratories, Chris Muzny director
Quantity | Value | Units | Method | Reference | Comment |
---|---|---|---|---|---|
Tboil | 346. | K | N/A | Petrov, Kolesova, et al., 1957 | Uncertainty assigned by TRC = 3. K |

Gas phase ion energetics data

Data compiled by: Henry M. Rosenstock, Keith Draxl, Bruce W. Steiner, and John T. Herron
Appearance energy determinations
Ion | AE (eV) | Other Products | Method | Reference | Comment |
---|---|---|---|---|---|
C5H5+ | 12.2 | CH3 | EI | Harrison, Haynes, et al., 1965 | |
C6H5+ | 12.7 | H2+H | EI | Harrison, Haynes, et al., 1965 | |
C6H7+ | 10.7 | H | EI | Harrison, Haynes, et al., 1965 |

References

Petrov, Kolesova, et al., 1957
Petrov, A.A.; Kolesova, V.A.; Porfir'eva, Y.I.,
Conjugated Systems. LXXVIII Raman Spectra and Reactivity of Vinylacetylenic Hydrocarbons,
Zh. Obshch. Khim., 1957, 27, 2081-7. [all data]
Harrison, Haynes, et al., 1965
Harrison, A.G.; Haynes, P.; McLean, S.; Meyer, F.,
The mass spectra of methyl-substituted cyclopentadienes,
J. Am. Chem. Soc., 1965, 87, 5099. [all data]