But-1-ene-3-yne, 1-ethoxy-
- Formula: C6H8O
- Molecular weight: 96.1271
- IUPAC Standard InChIKey: LYWWXPVUSWJFCZ-AATRIKPKSA-N
- CAS Registry Number: 2806-41-9
- Chemical structure:
View 3d structure (requires JavaScript / HTML 5) - Permanent link for this species. Use this link for bookmarking this species for future reference.

Gas phase ion energetics data

Data compiled by: Sharon G. Lias, John E. Bartmess, Joel F. Liebman, John L. Holmes, Rhoda D. Levin, and W. Gary Mallard
Appearance energy determinations
Ion | AE (eV) | Other Products | Method | Reference | Comment |
---|---|---|---|---|---|
C4H4O+ | 9.22 | C2H4 | EI | Burgers, Holmes, et al., 1982 |

References

Burgers, Holmes, et al., 1982
Burgers, P.C.; Holmes, J.L.; Lossing, F.P.; Mommers, A.A.; Povel, F.R.; Terlouw, J.K.,
Isomeric and tautomeric [C4H4O]+ ions. Their thermochemistry and collisionally induced fragmentation characteristics,
Can. J. Chem., 1982, 60, 2246. [all data]