2,3-Dioxabicyclo[2.2.2]octane
- Formula: C6H10O2
- Molecular weight: 114.1424
- IUPAC Standard InChIKey: BFPOIBUGVNVNKU-UHFFFAOYSA-N
- CAS Registry Number: 280-53-5
- Chemical structure:
View 3d structure (requires JavaScript / HTML 5) - Permanent link for this species. Use this link for bookmarking this species for future reference.

Gas phase ion energetics data

Data compiled by: Sharon G. Lias, Rhoda D. Levin, and Sherif A. Kafafi
Ionization energy determinations
IE (eV) | Method | Reference | Comment |
---|---|---|---|
8.83 | PE | Gleiter, Schang, et al., 1980 | Vertical value |
8.82 | PE | Coughlin, Brown, et al., 1979 | Vertical value |

References

Gleiter, Schang, et al., 1980
Gleiter, R.; Schang, P.; Adam, W.; Eggelte, H.J.; Erden, I.; Bloodworth, A.J.,
Photoelectron spectra of bicyclic peroxides,
J. Electron Spectrosc. Relat. Phenom., 1980, 19, 223. [all data]
Coughlin, Brown, et al., 1979
Coughlin, D.J.; Brown, R.S.; Salomon, R.G.,
The prostaglandin endoperoxide nucleus and related bicyclic peroxides. Synthetic and spectroscopic studies,
J. Am. Chem. Soc., 1979, 101, 1533. [all data]