7-Thiabicyclo[2.2.1]heptane
- Formula: C6H10S
- Molecular weight: 114.209
- IUPAC Standard InChIKey: YADULIHSBVCGOJ-UHFFFAOYSA-N
- CAS Registry Number: 279-59-4
- Chemical structure:
View 3d structure (requires JavaScript / HTML 5) - Other names: 7-Thianorboranane

Gas phase ion energetics data

Data compiled by: Sharon G. Lias, Rhoda D. Levin, and Sherif A. Kafafi
Ionization energy determinations
IE (eV) | Method | Reference |
---|---|---|
8.28 ± 0.04 | PE | Bunzli, Frost, et al., 1973 |

References

Bunzli, Frost, et al., 1973
Bunzli, J.C.; Frost, D.C.; Weiler, L.,
Photoelectron spectrum of 7-thiabicyclo[2.2.1]heptane,
J. Am. Chem. Soc., 1973, 95, 7880. [all data]