Tricyclo[2.2.1.0(2,6)]heptane
- Formula: C7H10
- Molecular weight: 94.1543
- IUPAC Standard InChIKey: BYBGSCXPMGPLFP-UHFFFAOYSA-N
- CAS Registry Number: 279-19-6
- Chemical structure:
View 3d structure (requires JavaScript / HTML 5) - Other names: Nortricyclane; Nortricyclen; Nortricyclene; Tricyclo[2.2.1.0dimethyl2dimethyl,dimethyl6]heptane; Tricyclo[2.2.1.0(2.6)]heptane; Tricyclo[2.2.1.0^2^,^6]heptane

Gas phase thermochemistry data

Data compiled by: Hussein Y. Afeefy, Joel F. Liebman, and Stephen E. Stein
Quantity | Value | Units | Method | Reference | Comment |
---|---|---|---|---|---|
ΔfH°gas | 80. ± 20. | kJ/mol | AVG | N/A | Average of 6 values; Individual data points |

Condensed phase thermochemistry data

Data compiled as indicated in comments:
ALS - Hussein Y. Afeefy, Joel F. Liebman, and Stephen E. Stein
DH - Eugene S. Domalski and Elizabeth D. Hearing
Quantity | Value | Units | Method | Reference | Comment |
---|---|---|---|---|---|
ΔfH°liquid | 43.4 ± 2.0 | kJ/mol | Ccb | Steele, 1978 | ALS |
ΔfH°liquid | 24.0 ± 2.2 | kJ/mol | Ccb | Hall, Smith, et al., 1973 | ALS |
Quantity | Value | Units | Method | Reference | Comment |
ΔcH°liquid | -4227.1 ± 2.0 | kJ/mol | Ccb | Steele, 1978 | Corresponding ΔfHºliquid = 43.4 kJ/mol (simple calculation by NIST; no Washburn corrections); ALS |
ΔcH°liquid | -4207.8 ± 2.2 | kJ/mol | Ccb | Hall, Smith, et al., 1973 | Corresponding ΔfHºliquid = 24.1 kJ/mol (simple calculation by NIST; no Washburn corrections); ALS |
Quantity | Value | Units | Method | Reference | Comment |
ΔfH°solid | 31.0 ± 1.1 | kJ/mol | Ccb | Kozina, Bychikhina, et al., 1976 | ALS |
Quantity | Value | Units | Method | Reference | Comment |
ΔcH°solid | -4214.8 ± 1.0 | kJ/mol | Ccb | Kozina, Bychikhina, et al., 1976 | Corresponding ΔfHºsolid = 31.1 kJ/mol (simple calculation by NIST; no Washburn corrections); ALS |
Constant pressure heat capacity of solid
Cp,solid (J/mol*K) | Temperature (K) | Reference | Comment |
---|---|---|---|
129.0 | 298.15 | Steele, 1978 | DH |
110.2 | 297. | Hall, Smith, et al., 1973 | DH |

Phase change data

Data compiled as indicated in comments:
AC - William E. Acree, Jr., James S. Chickos
ALS - Hussein Y. Afeefy, Joel F. Liebman, and Stephen E. Stein
DRB - Donald R. Burgess, Jr.
Quantity | Value | Units | Method | Reference | Comment |
---|---|---|---|---|---|
ΔvapH° | 38.5 | kJ/mol | N/A | Osmont, Catoire, et al., 2008 | AC |
ΔvapH° | 38.7 ± 0.7 | kJ/mol | C | Steele, 1978 | ALS |
ΔvapH° | 38.7 | kJ/mol | N/A | Steele, 1978 | DRB |
ΔvapH° | 38.0 ± 0.08 | kJ/mol | V | Hall, Smith, et al., 1973 | ALS |
ΔvapH° | 38.0 | kJ/mol | N/A | Hall, Smith, et al., 1973 | DRB |
Quantity | Value | Units | Method | Reference | Comment |
ΔsubH° | 38.7 ± 0.7 | kJ/mol | BG | Steele, 1978 | AC |
ΔsubH° | 39.2 ± 1.1 | kJ/mol | C | Kozina, Bychikhina, et al., 1976, 2 | AC |
ΔsubH° | 39.2 ± 1.1 | kJ/mol | V | Kozina, Bychikhina, et al., 1976 | ALS |
ΔsubH° | 39.2 | kJ/mol | N/A | Kozina, Bychikhina, et al., 1976 | DRB |
Enthalpy of vaporization
ΔvapH (kJ/mol) | Temperature (K) | Method | Reference | Comment |
---|---|---|---|---|
38.3 | 317. | A | Stephenson and Malanowski, 1987 | Based on data from 302. to 337. K.; AC |

Reaction thermochemistry data

Data compiled by: Hussein Y. Afeefy, Joel F. Liebman, and Stephen E. Stein
Individual Reactions
By formula: H2 + C7H10 = C7H12
Quantity | Value | Units | Method | Reference | Comment |
---|---|---|---|---|---|
ΔrH° | -130. ± 0.8 | kJ/mol | Chyd | Flury, Grob, et al., 1988 | liquid phase; solvent: Isooctane |
ΔrH° | -136.3 ± 2.2 | kJ/mol | Chyd | Rogers, Choi, et al., 1980 | liquid phase; solvent: Hexane; Author was aware that data differs from previously reported values |

Gas phase ion energetics data

Data compiled as indicated in comments:
LBLHLM - Sharon G. Lias, John E. Bartmess, Joel F. Liebman, John L. Holmes, Rhoda D. Levin, and W. Gary Mallard
LLK - Sharon G. Lias, Rhoda D. Levin, and Sherif A. Kafafi
RDSH - Henry M. Rosenstock, Keith Draxl, Bruce W. Steiner, and John T. Herron
Ionization energy determinations
IE (eV) | Method | Reference | Comment |
---|---|---|---|
8.7 | PE | Della, Pigou, et al., 1985 | LBLHLM |
8.92 ± 0.01 | EI | Holmes and McGillivray, 1971 | LLK |
9.02 | PE | Bodor, Dewar, et al., 1970 | RDSH |
9.37 | PE | Della, Pigou, et al., 1985 | Vertical value; LBLHLM |
9.40 | PE | Haselbach, Heilbronner, et al., 1972 | Vertical value; LLK |
Appearance energy determinations
Ion | AE (eV) | Other Products | Method | Reference | Comment |
---|---|---|---|---|---|
C5H6+ | 9.44 ± 0.01 | C2H4 | EI | Holmes and McGillivray, 1971 | LLK |
C6H7+ | 10.17 ± 0.01 | CH3 | EI | Holmes and McGillivray, 1971 | LLK |
C7H9+ | 11.3 ± 0.01 | H | EI | Holmes and McGillivray, 1971 | LLK |

Normal alkane RI, non-polar column, custom temperature program

Column type | Active phase | I | Reference | Comment |
---|---|---|---|---|
Capillary | Methyl Silicone | 857. | Zenkevich, 1995 | Program: not specified |

References

Steele, 1978
Steele, W.V.,
The standard enthalpies of formation of a series of C7, bridged-ring hydrocarbons: norbornane, norbornene, nortricyclene, norbornadiene, and quadricyclane,
J. Chem. Thermodyn., 1978, 10, 919-927. [all data]
Hall, Smith, et al., 1973
Hall, H.K., Jr.; Smith, C.D.; Baldt, J.H.,
Enthalpies of formation of norticyclene, norbornene, norbornadiene, and quadricyclane,
J. Am. Chem. Soc., 1973, 95, 3197-3201. [all data]
Kozina, Bychikhina, et al., 1976
Kozina, M.P.; Bychikhina, L.V.; Gal'chenko, G.L.; Mil'vitskaya, E.M.; Ordubadi, M.; Plate, A.F.,
Enthalpies of nortricyclene and norbornene formation,
Dokl. Akad. Nauk SSSR, 1976, 226, 1105-1108. [all data]
Osmont, Catoire, et al., 2008
Osmont, Antoine; Catoire, Laurent; Gokalp, Iskender,
Physicochemical Properties and Thermochemistry of Propellanes,
Energy Fuels, 2008, 22, 4, 2241-2257, https://doi.org/10.1021/ef8000423
. [all data]
Kozina, Bychikhina, et al., 1976, 2
Kozina, M.P.; Bychikhina, L.V.; Gal'chenko, G.V.; Milwitskaya, E.M.; Ordubade, M.; Plate, A.F.,
Dokl. Akad. Nauk SSSR, 1976, 226, 1105. [all data]
Stephenson and Malanowski, 1987
Stephenson, Richard M.; Malanowski, Stanislaw,
Handbook of the Thermodynamics of Organic Compounds, 1987, https://doi.org/10.1007/978-94-009-3173-2
. [all data]
Flury, Grob, et al., 1988
Flury, P.; Grob, C.A.; Wang, G.Y.; Lennatz, H.-W.; Roth, W.R.,
113. Norbornanes. Bridging strain in norbornyl and oxanorbornyl cations,
Helv. Chim. Acta, 1988, 71, 1017-1024. [all data]
Rogers, Choi, et al., 1980
Rogers, D.W.; Choi, L.S.; Girellini, R.S.,
Heats of hydrogenation and formation of quadricyclene, norbornadiene, norbornene, and nortricyclene,
J. Phys. Chem., 1980, 84, 1810-1814. [all data]
Della, Pigou, et al., 1985
Della, E.W.; Pigou, P.E.; Livett, M.K.; Peel, J.B.,
The photoelectron spectrum of 1-bromotricyclene,
Aust. J. Chem., 1985, 38, 69. [all data]
Holmes and McGillivray, 1971
Holmes, J.L.; McGillivray, D.,
The mass spectra of isomeric hydrocarbons-I: Norbornene and nortricyclene; The mechanisms and energetics of their fragmentations,
Org. Mass Spectrom., 1971, 5, 1349. [all data]
Bodor, Dewar, et al., 1970
Bodor, N.; Dewar, M.J.S.; Worley, S.D.,
Photoelectron spectra of molecules. III. Ionization potentials of some cyclic hydrocarbons and their derivatives, and heats of formation and ionization potentials calculated by the MINDO SCF MO method,
J. Am. Chem. Soc., 1970, 92, 19. [all data]
Haselbach, Heilbronner, et al., 1972
Haselbach, E.; Heilbronner, E.; Musso, H.; Schmelzer, A.,
Notiz uber die Photoelektronen-Spektren des Nortricyclens und des Triasterans,
Helv. Chim. Acta, 1972, 55, 302. [all data]
Zenkevich, 1995
Zenkevich, I.G.,
Calculation of Gas-Chromatographic Retention Indices from Physico-Chemical Constants of Organic Compounds,
Z. Anal. Chem., 1995, 50, 10, 1048-1056. [all data]