2,4-Cyclohexadien-1-one,6-methylene-
- Formula: C7H6O
- Molecular weight: 106.1219
- IUPAC Standard InChIKey: NSDWWGAIPUNJAX-UHFFFAOYSA-N
- CAS Registry Number: 27890-67-1
- Chemical structure:
View 3d structure (requires JavaScript / HTML 5) - Permanent link for this species. Use this link for bookmarking this species for future reference.

Gas phase ion energetics data

Data compiled by: Sharon G. Lias, Rhoda D. Levin, and Sherif A. Kafafi
Ionization energy determinations
IE (eV) | Method | Reference | Comment |
---|---|---|---|
8.80 | PE | Eck, Schweig, et al., 1978 | Vertical value |

References

Eck, Schweig, et al., 1978
Eck, V.; Schweig, A.; Vermeer, H.,
The ultraviolet photoelectron spectrum of o-benzoquinone methide,
Tetrahedron Lett., 1978, 27, 2433. [all data]