Cyclopent[4,5]azepino[2,1,7-cd]pyrrolizine
- Formula: C14H9N
- Molecular weight: 191.2280
- IUPAC Standard InChIKey: NCTLVUDKEUVIDI-UHFFFAOYSA-N
- CAS Registry Number: 27884-38-4
- Chemical structure:
View 3d structure (requires JavaScript / HTML 5) - Permanent link for this species. Use this link for bookmarking this species for future reference.

Gas phase ion energetics data

Data compiled by: Sharon G. Lias, Rhoda D. Levin, and Sherif A. Kafafi
Ionization energy determinations
IE (eV) | Method | Reference | Comment |
---|---|---|---|
7.06 | PE | Palmer, Leaver, et al., 1977 | Vertical value |

References

Palmer, Leaver, et al., 1977
Palmer, M.H.; Leaver, D.; Nisbet, J.D.; Millar, R.W.; Egdell, R.,
The electronic structure of some J. Heterocycl. Chem. with bridgehead nitrogen: photoelectron spectra and ab initio molecular orbital calculations,
J. Mol. Struct., 1977, 42, 85. [all data]