Pyrazino[2,1,6-cd]pyrrolizine
- Formula: C9H6N2
- Molecular weight: 142.1573
- IUPAC Standard InChIKey: OSSKPAOPEGASMO-UHFFFAOYSA-N
- CAS Registry Number: 27884-36-2
- Chemical structure:
View 3d structure (requires JavaScript / HTML 5) - Permanent link for this species. Use this link for bookmarking this species for future reference.

Gas phase ion energetics data

Data compiled by: Sharon G. Lias, Rhoda D. Levin, and Sherif A. Kafafi
Ionization energy determinations
IE (eV) | Method | Reference | Comment |
---|---|---|---|
7.65 | PE | Palmer, Leaver, et al., 1977 | Vertical value |

References

Palmer, Leaver, et al., 1977
Palmer, M.H.; Leaver, D.; Nisbet, J.D.; Millar, R.W.; Egdell, R.,
The electronic structure of some J. Heterocycl. Chem. with bridgehead nitrogen: photoelectron spectra and ab initio molecular orbital calculations,
J. Mol. Struct., 1977, 42, 85. [all data]