Thiourea, tetramethyl-
- Formula: C5H12N2S
- Molecular weight: 132.227
- IUPAC Standard InChIKey: MNOILHPDHOHILI-UHFFFAOYSA-N
- CAS Registry Number: 2782-91-4
- Chemical structure:
View 3d structure (requires JavaScript / HTML 5) - Other names: Urea, 1,1,3,3-tetramethyl-2-thio-; Basthioryl; N,N,N',N'-Tetramethylthiourea; Tetramethylthiourea; ((CH3)2N)2CS; 1,1,3,3-Tetramethyl-2-thiourea; 1,1,3,3-Tetramethylthiourea; NA-101; TMTU; Urea, thio-, tetramethyl-; NSC 102499; Thiourea, N,N,N',N'-tetramethyl-; tetramethyl-2-thiourea

Gas phase thermochemistry data

Data compiled by: Hussein Y. Afeefy, Joel F. Liebman, and Stephen E. Stein
Quantity | Value | Units | Method | Reference | Comment |
---|---|---|---|---|---|
ΔfH°gas | 44.7 ± 2.3 | kJ/mol | Ccr | Inagaki, Murata, et al., 1982 |

Condensed phase thermochemistry data

Data compiled by: Hussein Y. Afeefy, Joel F. Liebman, and Stephen E. Stein
Quantity | Value | Units | Method | Reference | Comment |
---|---|---|---|---|---|
ΔfH°solid | -38.3 ± 2.3 | kJ/mol | Ccr | Inagaki, Murata, et al., 1982 | |
Quantity | Value | Units | Method | Reference | Comment |
ΔcH°solid | -4246.7 ± 2.2 | kJ/mol | Ccr | Inagaki, Murata, et al., 1982 |

Phase change data

Data compiled as indicated in comments:
AC - William E. Acree, Jr., James S. Chickos
ALS - Hussein Y. Afeefy, Joel F. Liebman, and Stephen E. Stein
Quantity | Value | Units | Method | Reference | Comment |
---|---|---|---|---|---|
ΔsubH° | 85. ± 3. | kJ/mol | ME | Della Gatta, Józwiak, et al., 2000 | AC |
ΔsubH° | 84.0 | kJ/mol | N/A | Ferro, Martino, et al., 1994 | AC |
ΔsubH° | 83.0 ± 0.5 | kJ/mol | C | Murata, Sakiyama, et al., 1985 | AC |
ΔsubH° | 83.03 ± 0.20 | kJ/mol | C | Inagaki, Murata, et al., 1982 | ALS |
ΔsubH° | 83.0 ± 0.2 | kJ/mol | C | Inagaki, Murata, et al., 1982 | AC |
Enthalpy of sublimation
ΔsubH (kJ/mol) | Temperature (K) | Method | Reference | Comment |
---|---|---|---|---|
83. ± 3.0 | 333. | TE | Ferro, Martino, et al., 1994 | AC |
Enthalpy of fusion
ΔfusH (kJ/mol) | Temperature (K) | Method | Reference | Comment |
---|---|---|---|---|
22.14 | 350.4 | DSC | Della Gatta, Józwiak, et al., 2000 | AC |

Gas phase ion energetics data

Data evaluated as indicated in comments:
HL - Edward P. Hunter and Sharon G. Lias
Data compiled as indicated in comments:
LBLHLM - Sharon G. Lias, John E. Bartmess, Joel F. Liebman, John L. Holmes, Rhoda D. Levin, and W. Gary Mallard
LLK - Sharon G. Lias, Rhoda D. Levin, and Sherif A. Kafafi
RDSH - Henry M. Rosenstock, Keith Draxl, Bruce W. Steiner, and John T. Herron
Quantity | Value | Units | Method | Reference | Comment |
---|---|---|---|---|---|
Proton affinity (review) | 947.6 | kJ/mol | N/A | Hunter and Lias, 1998 | HL |
Quantity | Value | Units | Method | Reference | Comment |
Gas basicity | 916.6 | kJ/mol | N/A | Hunter and Lias, 1998 | HL |
Ionization energy determinations
IE (eV) | Method | Reference | Comment |
---|---|---|---|
7.82 ± 0.03 | PE | Guimon, Pfister-Guillouzo, et al., 1974 | LLK |
7.95 ± 0.05 | EI | Baldwin, Maccoll, et al., Ind. 1966 | RDSH |
7.84 | PE | Roth, Bock, et al., 1985 | Vertical value; LBLHLM |
7.84 | PE | Mines and Thompson, 1975 | Vertical value; LLK |
7.82 | PE | Guimon, Gonbeau, et al., 1974 | Vertical value; LLK |
Appearance energy determinations
Ion | AE (eV) | Other Products | Method | Reference | Comment |
---|---|---|---|---|---|
C2H6N+ | 10.35 | ? | EI | Loudon and Webb, 1977 | LLK |
C3H6NS+ | 11.20 | ? | EI | Loudon and Webb, 1977 | LLK |

Normal alkane RI, polar column, temperature ramp

Column type | Active phase | I | Reference | Comment |
---|---|---|---|---|
Capillary | PEG-20M | 1872. | Kubota, Matsujage, et al., 1996 | 50. m/0.25 mm/0.25 μm, Nitrogen, 2. K/min; Tstart: 60. C; Tend: 180. C |

References

Inagaki, Murata, et al., 1982
Inagaki, S.; Murata, S.; Sakiyama, M.,
Thermochemical studies on thioacetamide and tetramethylthiourea. Estimation of stablization energies due to interaction between thiocarbonyl group and neighboring nitrogen atom,
Bull. Chem. Soc. Jpn., 1982, 55, 2808-2813. [all data]
Della Gatta, Józwiak, et al., 2000
Della Gatta, Giuseppe; Józwiak, Malgorzata; Brunetti, Bruno; Abate, Lorenzo,
Enthalpies and entropies of fusion and of sublimation at the temperature 298.15 K of thiourea and sevenN-alkylthioureas,
The Journal of Chemical Thermodynamics, 2000, 32, 8, 979-997, https://doi.org/10.1006/jcht.2000.0662
. [all data]
Ferro, Martino, et al., 1994
Ferro, Daniela; Martino, Rosalba; Gatta, Giuseppe Della,
Sublimation enthalpies and entropies of thiourea, 1-methyl-2-thiourea, 1,3-dimethyl-2-thiourea, and 1,1,3,3-tetramethyl-2-thiourea,
The Journal of Chemical Thermodynamics, 1994, 26, 2, 183-190, https://doi.org/10.1006/jcht.1994.1037
. [all data]
Murata, Sakiyama, et al., 1985
Murata, S.; Sakiyama, M.; Seki, S.,
Sublimation calorimetric studies using a calvet microcalorimeter,
Thermochimica Acta, 1985, 88, 1, 121-126, https://doi.org/10.1016/0040-6031(85)85419-8
. [all data]
Hunter and Lias, 1998
Hunter, E.P.; Lias, S.G.,
Evaluated Gas Phase Basicities and Proton Affinities of Molecules: An Update,
J. Phys. Chem. Ref. Data, 1998, 27, 3, 413-656, https://doi.org/10.1063/1.556018
. [all data]
Guimon, Pfister-Guillouzo, et al., 1974
Guimon, C.; Pfister-Guillouzo, G.; Arbelot, M.; Chanon, M.,
Electronic structure of sulphur compounds. VII. Photoelectron spectra of thiocarbonyl J. Heterocycl. Chem..,
Tetrahedron, 1974, 30, 3831. [all data]
Baldwin, Maccoll, et al., Ind. 1966
Baldwin, M.; Maccoll, A.; Kirkien-Konasiewicz, A.; Saville, B.,
Ionisation potentials of the N-methylated thioureas,
Chem., Ind. 1966, 286. [all data]
Roth, Bock, et al., 1985
Roth, B.; Bock, H.; Gotthardt, H.,
Radikalionen 66. Thioparabansaure-derivate: Ionisation zum Radikalkation und reduktion zum radikalanion,
Phosphorus Sulfur, 1985, 22, 109. [all data]
Mines and Thompson, 1975
Mines, G.W.; Thompson, H.W.,
The photoelectron spectra of amides, thioamides, ureas and thioureas,
Spectrochim. Acta, 1975, 31, 137. [all data]
Guimon, Gonbeau, et al., 1974
Guimon, C.; Gonbeau, D.; Pfister-Guillouzo, G.; Asbrink, L.; Sandstrom, J.,
Electronic structure of sulphur compounds. VI. Photoelectron spectra of some simple thiocarbonyl compounds,
J. Electron Spectrosc. Relat. Phenom., 1974, 4, 49. [all data]
Loudon and Webb, 1977
Loudon, A.G.; Webb, K.S.,
The nature of the [C2H6N]+ and [CH4N]+ ions formed by electron impact on methylated formamides, acetamides, ureas, thioureas and hexamethylphosphoramide,
Org. Mass Spectrom., 1977, 12, 283. [all data]
Koch, 1949
Koch, H.P.,
J. Chem. Soc., 1949, 401. [all data]
Kubota, Matsujage, et al., 1996
Kubota, K.; Matsujage, Y.; Sekiwa, Y.; Kobayashi, A.,
Identification of the characteristic volatile flavor compounds formed by cooking squid (Todarodes pacificus Steenstrup),
Food Sci. Technol., 1996, 2, 3, 163-166. [all data]