8-Azabicyclo[3.2.1]octane,3-bromo-8-methyl-endo-

Gas phase ion energetics data

Data compiled by: Sharon G. Lias, Rhoda D. Levin, and Sherif A. Kafafi

Appearance energy determinations

Ion AE (eV) Other Products MethodReferenceComment
C8H14N+9.1 ± 0.3BrEIGrutzmacher and Lange, 1978

References

Grutzmacher and Lange, 1978
Grutzmacher, H.-F.; Lange, G., Untersuchungen zur synchronen oder zweistufigen Fragmentierung der Molekul-Ionen von 3-substituierten Tropanen, Chem. Ber., 1978, 111, 1962. [all data]