Benzo[c]naphtho[2,1-p]chrysene
- Formula: C30H18
- Molecular weight: 378.4639
- IUPAC Standard InChIKey: JNILXLCSAFFNTK-UHFFFAOYSA-N
- CAS Registry Number: 27798-46-5
- Chemical structure:
View 3d structure (requires JavaScript / HTML 5) - Permanent link for this species. Use this link for bookmarking this species for future reference.

Gas phase ion energetics data

Data compiled as indicated in comments:
LLK - Sharon G. Lias, Rhoda D. Levin, and Sherif A. Kafafi
Ionization energy determinations
IE (eV) | Method | Reference | Comment |
---|---|---|---|
7.19 ± 0.02 | PE | Schmidt, 1977 | Vertical value; LLK |

References

Schmidt, 1977
Schmidt, W.,
Photoelectron spectra of polynuclear aromatics. V. Correlations with ultraviolet absorption spectra in the catacondensed series,
J. Chem. Phys., 1977, 66, 828. [all data]