Butane, 1-isocyano-
- Formula: C5H9N
- Molecular weight: 83.1317
- IUPAC Standard InChIKey: FSBLVBBRXSCOKU-UHFFFAOYSA-N
- CAS Registry Number: 2769-64-4
- Chemical structure:
View 3d structure (requires JavaScript / HTML 5) - Other names: Butyl isocyanide; n-Butyl isocyanide; Butylisonitrile; n-C4H9NC

Gas phase ion energetics data

Data compiled as indicated in comments:
LLK - Sharon G. Lias, Rhoda D. Levin, and Sherif A. Kafafi
RDSH - Henry M. Rosenstock, Keith Draxl, Bruce W. Steiner, and John T. Herron
Ionization energy determinations
IE (eV) | Method | Reference | Comment |
---|---|---|---|
11.71 ± 0.05 | EI | Distefano, Innorta, et al., 1968 | RDSH |
11.1 | PE | Young and Cheng, 1976 | Vertical value; LLK |
Appearance energy determinations
Ion | AE (eV) | Other Products | Method | Reference | Comment |
---|---|---|---|---|---|
C2H3N+ | 12.75 | ? | EI | Heerma and deRidder, 1970 | RDSH |
C3H4N+ | 12.80 | ? | EI | Heerma and deRidder, 1970 | RDSH |
C3H5+ | 13.35 | ? | EI | Heerma and deRidder, 1970 | RDSH |
C3H5N+ | 11.80 | ? | EI | Heerma and deRidder, 1970 | RDSH |
C3H7+ | 12.80 | ? | EI | Heerma and deRidder, 1970 | RDSH |
C4H7+ | 13.00 | ? | EI | Heerma and deRidder, 1970 | RDSH |
C4H8+ | 12.00 | ? | PE | Rowland, 1971 | Unpublished result of J.H.D. Eland; LLK |

References

Distefano, Innorta, et al., 1968
Distefano, G.; Innorta, G.; Pignataro, S.; Foffani, A.,
Correlation between the ionization potentials of transition metal complexes and of the corresponding ligands,
J. Organometal. Chem., 1968, 14, 165. [all data]
Young and Cheng, 1976
Young, V.Y.; Cheng, K.L.,
The ultraviolet photoelectron spectra of aliphatic aromatic isonitriles,
J. Electron Spectrosc. Relat. Phenom., 1976, 9, 317. [all data]
Heerma and deRidder, 1970
Heerma, W.; deRidder, J.J.,
The electron-impact induced fragmentation of some alkyl isocyanides and alpha-branched alkyl cyanides,
Org. Mass Spectrom., 1970, 3, 1439. [all data]
Rowland, 1971
Rowland, C.G.,
Kinetic energy distributions of C12H8 fragment ions in the mass spectra of anthracene, phenanthrene and diphenylacetylene,
Intern. J. Mass Spectrom. Ion Phys., 1971, 7, 79. [all data]