(Z)-3-Heptene, 2,2,4,6,6-pentamethyl-
- Formula: C12H24
- Molecular weight: 168.3190
- IUPAC Standard InChIKey: NBUMCEJRJRRLCA-NTMALXAHSA-N
- CAS Registry Number: 27656-50-4
- Chemical structure:
View 3d structure (requires JavaScript / HTML 5) - Stereoisomers:

Phase change data

Data compiled by: William E. Acree, Jr., James S. Chickos
Quantity | Value | Units | Method | Reference | Comment |
---|---|---|---|---|---|
ΔvapH° | 63.2 ± 0.5 | kJ/mol | GS | Verevkin, Wandschneider, et al., 2000 | Based on data from 288. to 318. K. |
Enthalpy of vaporization
ΔvapH (kJ/mol) | Temperature (K) | Method | Reference | Comment |
---|---|---|---|---|
63.0 ± 0.5 | 303. | GS | Verevkin, Wandschneider, et al., 2000 | Based on data from 288. to 318. K. |

Gas phase ion energetics data

Data compiled as indicated in comments:
LLK - Sharon G. Lias, Rhoda D. Levin, and Sherif A. Kafafi
Ionization energy determinations
IE (eV) | Method | Reference | Comment |
---|---|---|---|
8.346 ± 0.005 | PE | Masclet, Grosjean, et al., 1973 | LLK |

References

Verevkin, Wandschneider, et al., 2000
Verevkin, Sergey P.; Wandschneider, Dirk; Heintz, Andreas,
Determination of Vaporization Enthalpies of Selected Linear and Branched C 7 , C 8 , C 9 , C 11 , and C 12 Monoolefin Hydrocarbons from Transpiration and Correlation Gas-Chromatography Methods,
J. Chem. Eng. Data, 2000, 45, 4, 618-625, https://doi.org/10.1021/je990297k
. [all data]
Masclet, Grosjean, et al., 1973
Masclet, P.; Grosjean, D.; Mouvier, G.,
Alkene ionization potentials. Part I. Quantitative determination of alkyl group structural effects,
J. Electron Spectrosc. Relat. Phenom., 1973, 2, 225. [all data]