1H-2-Silaindene,2,3-dihydro-2,2-dimethyl-
- Formula: C10H14Si
- Molecular weight: 162.3037
- IUPAC Standard InChIKey: GCMFIUAXWRNTCR-UHFFFAOYSA-N
- CAS Registry Number: 2764-87-6
- Chemical structure:
View 3d structure (requires JavaScript / HTML 5) - Permanent link for this species. Use this link for bookmarking this species for future reference.

Gas phase ion energetics data

Data compiled by: Henry M. Rosenstock, Keith Draxl, Bruce W. Steiner, and John T. Herron
Ionization energy determinations
IE (eV) | Method | Reference |
---|---|---|
8.41 | CTS | Pitt, 1970 |

References

Pitt, 1970
Pitt, C.G.,
Hyperconjugation: An alternative to the concept of the pπ-dπ bond in Group IV chemistry,
J. Organomet. Chem., 1970, 23, 35. [all data]