Benzenesulfenic acid
- Formula: C6H6OS
- Molecular weight: 126.176
- IUPAC Standard InChIKey: NBADVBNRRHVIAO-UHFFFAOYSA-N
- CAS Registry Number: 27610-20-4
- Chemical structure:
View 3d structure (requires JavaScript / HTML 5) - Permanent link for this species. Use this link for bookmarking this species for future reference.

Gas phase thermochemistry data

Data compiled by: Hussein Y. Afeefy, Joel F. Liebman, and Stephen E. Stein
Quantity | Value | Units | Method | Reference | Comment |
---|---|---|---|---|---|
ΔfH°gas | -34. | kJ/mol | Ion | Turecek, Brabec, et al., 1988 |

Gas phase ion energetics data

Data compiled by: Sharon G. Lias and Joel F. Liebman
Ionization energy determinations
IE (eV) | Method | Reference |
---|---|---|
8.45 ± 0.03 | EI | Turecek, Brabec, et al., 1988, 2 |

References

Turecek, Brabec, et al., 1988
Turecek, F.; Brabec, L.; Vondrak, t.; Hanus, V.; Hajicek, J.; Havlas, Z.,
Sulfenic acids in the gas phase. Preparation, ionization energies and heats of formation of methane-, ethene-, ethyne- and benzenesulfenic acid,
Collect. Czech. Chem. Commun., 1988, 53, 2140-2158. [all data]
Turecek, Brabec, et al., 1988, 2
Turecek, F.; Brabec, L.; Vondrak, T.; Hanus, V.; Hajicek, J.; Havlas, Z.,
Sulfenic acids in the gas phase. Prepration, ionization energies and heats of gormation of methane-, ethene-, ethyne- and benzenesulfenic acid,
Collect. Czech. Chem. Commun., 1988, 53, 2140. [all data]