2-Chloropropionanilide
- Formula: C9H10ClNO
- Molecular weight: 183.635
- IUPAC Standard InChIKey: VCVUMBWLSGNGFA-UHFFFAOYSA-N
- CAS Registry Number: 2760-32-9
- Chemical structure:
View 3d structure (requires JavaScript / HTML 5) - Other names: Propanamide,N-(2-chlorophenyl)-

Gas phase ion energetics data

Data compiled by: Sharon G. Lias, Rhoda D. Levin, and Sherif A. Kafafi
Ionization energy determinations
IE (eV) | Method | Reference |
---|---|---|
8.45 ± 0.05 | EI | Baldwin, Loudon, et al., 1976 |
Appearance energy determinations
Ion | AE (eV) | Other Products | Method | Reference | Comment |
---|---|---|---|---|---|
C6H6NCl+ | 10.75 | ? | EI | Baldwin, Loudon, et al., 1976 | |
C9H10NO+ | 9.45 | Cl | EI | Baldwin, Loudon, et al., 1976 |

References

Baldwin, Loudon, et al., 1976
Baldwin, M.A.; Loudon, A.G.; Maccoll, A.; Webb, K.S.,
The nature and fragmentation pathways of the molecular ions of some arylureas, arylthioureas, acetanilides, thioacetanilides and related compounds,
Org. Mass Spectrom., 1976, 11, 1181. [all data]