2-Methylenebornane
- Formula: C11H18
- Molecular weight: 150.2606
- IUPAC Standard InChIKey: ZASFWGOMAIPHLN-UHFFFAOYSA-N
- CAS Registry Number: 27538-47-2
- Chemical structure:
View 3d structure (requires JavaScript / HTML 5) - Other names: 1,7,7-Trimethyl-2-methylenebicyclo[2.2.1]heptane; 2-Methylene-1,7,7-trimethylbicyclo[2.2.1]heptane

Gas phase ion energetics data

Data compiled by: Henry M. Rosenstock, Keith Draxl, Bruce W. Steiner, and John T. Herron
Ionization energy determinations
IE (eV) | Method | Reference |
---|---|---|
8.6 ± 0.1 | PI | Demeo and El-Sayed, 1970 |

References

Demeo and El-Sayed, 1970
Demeo, D.A.; El-Sayed, M.A.,
Ionization potential and structure of olefins,
J. Chem. Phys., 1970, 52, 2622. [all data]