3H-Pyrazol-3-one, 2,4-dihydro-2,5-dimethyl-
- Formula: C5H8N2O
- Molecular weight: 112.1298
- IUPAC Standard InChIKey: NDELSWXIAJLWOU-UHFFFAOYSA-N
- CAS Registry Number: 2749-59-9
- Chemical structure:
View 3d structure (requires JavaScript / HTML 5) - Other names: 2-Pyrazolin-5-one, 1,3-dimethyl-; 1,3-Dimethyl-5-pyrazolinone; 1,3-Dimethyl-5-pyrazolone; 2,4-dihydro-2,5-dimethyl-3H-pyrazol-3-one

Gas phase ion energetics data

Data compiled by: Sharon G. Lias and Joel F. Liebman
Ionization energy determinations
IE (eV) | Method | Reference | Comment |
---|---|---|---|
8.65 ± 0.05 | PE | Vondrak, Bastl, et al., 1988 | Vertical value |

References

Vondrak, Bastl, et al., 1988
Vondrak, T.; Bastl, Z.; Bohm, S.,
Gas-phase tautomerism in 2,4-dihydropyrazol-3-ones: An ultraviolet photoelectron spectroscopic study and MNDO molecular orbital calculations,
J. Am. Chem. Soc., 1988, 641. [all data]