1H-2-Benzogermole,2,3-dihydro-2,2-dimethyl-
- Formula: C10H14Ge
- Molecular weight: 206.86
- IUPAC Standard InChIKey: LBHOWMZCJGRIDW-UHFFFAOYSA-N
- CAS Registry Number: 27490-21-7
- Chemical structure:
View 3d structure (requires JavaScript / HTML 5) - Permanent link for this species. Use this link for bookmarking this species for future reference.

Gas phase ion energetics data

Data compiled by: Henry M. Rosenstock, Keith Draxl, Bruce W. Steiner, and John T. Herron
Ionization energy determinations
IE (eV) | Method | Reference |
---|---|---|
8.39 | CTS | Pitt, 1970 |

References

Pitt, 1970
Pitt, C.G.,
Hyperconjugation: An alternative to the concept of the pπ-dπ bond in Group IV chemistry,
J. Organomet. Chem., 1970, 23, 35. [all data]