2-Silaindan,2-methyl-2-(trimethylsilyl)-
- Formula: C12H20Si2
- Molecular weight: 220.4582
- IUPAC Standard InChIKey: IGVMEAKDPBGCQZ-UHFFFAOYSA-N
- CAS Registry Number: 27490-20-6
- Chemical structure:
View 3d structure (requires JavaScript / HTML 5) - Permanent link for this species. Use this link for bookmarking this species for future reference.

Gas phase ion energetics data

Data compiled by: Henry M. Rosenstock, Keith Draxl, Bruce W. Steiner, and John T. Herron
Ionization energy determinations
IE (eV) | Method | Reference |
---|---|---|
8.37 | CTS | Pitt, 1970 |

References

Pitt, 1970
Pitt, C.G.,
Hyperconjugation: An alternative to the concept of the pπ-dπ bond in Group IV chemistry,
J. Organomet. Chem., 1970, 23, 35. [all data]