Indolizine
- Formula: C8H7N
- Molecular weight: 117.1479
- IUPAC Standard InChIKey: HOBCFUWDNJPFHB-UHFFFAOYSA-N
- CAS Registry Number: 274-40-8
- Chemical structure:
View 3d structure (requires JavaScript / HTML 5) - Other names: Pyrrolo[1,2-a]pyridine; Indolizin; Pyrrocolin; Pyrrocoline

Phase change data

Data compiled by: Robert L. Brown and Stephen E. Stein
Quantity | Value | Units | Method | Reference | Comment |
---|---|---|---|---|---|
Tboil | 478.2 | K | N/A | Weast and Grasselli, 1989 |

Gas phase ion energetics data

Data evaluated as indicated in comments:
L - Sharon G. Lias
Data compiled as indicated in comments:
LLK - Sharon G. Lias, Rhoda D. Levin, and Sherif A. Kafafi
Quantity | Value | Units | Method | Reference | Comment |
---|---|---|---|---|---|
IE (evaluated) | 7.24 | eV | N/A | N/A | L |
Ionization energy determinations
IE (eV) | Method | Reference | Comment |
---|---|---|---|
7.26 | EI | Corval, 1979 | LLK |
7.24 | PE | Palmer, Leaver, et al., 1977 | Vertical value; LLK |

References

Weast and Grasselli, 1989
CRC Handbook of Data on Organic Compounds, 2nd Editon, Weast,R.C and Grasselli, J.G., ed(s)., CRC Press, Inc., Boca Raton, FL, 1989, 1. [all data]
Corval, 1979
Corval, M.,
Elimination sous impact electronique de HCN et H a partir de l'Indole. Comparaison avec l'Indolizine,
Org. Mass Spectrom., 1979, 14, 213. [all data]
Palmer, Leaver, et al., 1977
Palmer, M.H.; Leaver, D.; Nisbet, J.D.; Millar, R.W.; Egdell, R.,
The electronic structure of some J. Heterocycl. Chem. with bridgehead nitrogen: photoelectron spectra and ab initio molecular orbital calculations,
J. Mol. Struct., 1977, 42, 85. [all data]