1-Butene, 2,3-dimethyl-
- Formula: C6H12
- Molecular weight: 84.1595
- IUPAC Standard InChIKey: OWWIWYDDISJUMY-UHFFFAOYSA-N
- CAS Registry Number: 27416-06-4
- Chemical structure:
View 3d structure (requires JavaScript / HTML 5) - Species with the same structure:

Gas phase ion energetics data

Data compiled by: Sharon G. Lias, Rhoda D. Levin, and Sherif A. Kafafi
Ionization energy determinations
IE (eV) | Method | Reference |
---|---|---|
9.01 | EI | Lossing and Traeger, 1975 |
Appearance energy determinations
Ion | AE (eV) | Other Products | Method | Reference | Comment |
---|---|---|---|---|---|
C5H9+ | 9.01 | CH3 | EI | Lossing and Traeger, 1975, 2 | |
C5H9+ | 10.19 | CH3 | EI | Lossing and Traeger, 1975 |

References

Lossing and Traeger, 1975
Lossing, F.P.; Traeger, J.C.,
Stabilization in cyclopentadienyl, cyclopentenyl, and cyclopentyl cations,
J. Am. Chem. Soc., 1975, 97, 1579. [all data]
Lossing and Traeger, 1975, 2
Lossing, F.P.; Traeger, J.C.,
Free radicals by mass spectrometry XLVI. Heats of formation of C5H7 and C5H9 radicals and cations.,
J. Am. Chem. Soc., 1975, 19, 9. [all data]