Benzene, 1-methylethoxy-
- Formula: C9H12O
- Molecular weight: 136.1910
- IUPAC Standard InChIKey: ZYNMJJNWXVKJJV-UHFFFAOYSA-N
- CAS Registry Number: 2741-16-4
- Chemical structure:
View 3d structure (requires JavaScript / HTML 5) - Other names: isopropoxybenzene

Phase change data

Data compiled as indicated in comments:
TRC - Thermodynamics Research Center, NIST Boulder Laboratories, Chris Muzny director
AC - William E. Acree, Jr., James S. Chickos
Quantity | Value | Units | Method | Reference | Comment |
---|---|---|---|---|---|
Tboil | 450.0 | K | N/A | Olson, Hipsher, et al., 1947 | Uncertainty assigned by TRC = 0.5 K; TRC |
Tboil | 450.4 | K | N/A | Perkin, 1896 | Uncertainty assigned by TRC = 0.5 K; TRC |
Quantity | Value | Units | Method | Reference | Comment |
Tfus | 240.10 | K | N/A | Olson, Hipsher, et al., 1947 | Uncertainty assigned by TRC = 0.3 K; TRC |
Enthalpy of vaporization
ΔvapH (kJ/mol) | Temperature (K) | Method | Reference | Comment |
---|---|---|---|---|
49.5 | 360. | A | Stephenson and Malanowski, 1987 | Based on data from 345. to 448. K. See also Heinrich, Surovy, et al., 1965 and Boublik, Fried, et al., 1984.; AC |

Gas phase ion energetics data

Data compiled as indicated in comments:
LLK - Sharon G. Lias, Rhoda D. Levin, and Sherif A. Kafafi
Ionization energy determinations
IE (eV) | Method | Reference | Comment |
---|---|---|---|
8.32 | PE | Dewar, Ernstbrunner, et al., 1974 | Vertical value; LLK |

Kovats' RI, non-polar column, isothermal

Column type | Active phase | Temperature (C) | I | Reference | Comment |
---|---|---|---|---|---|
Packed | SE-30 | 150. | 1016. | Tibor and Anna, 1971 | N2, Chromosorb W-AW; Column length: 2. m |
Packed | SE-30 | 170. | 1027. | Tibor and Anna, 1971 | N2, Chromosorb W-AW; Column length: 2. m |

Kovats' RI, polar column, isothermal

Column type | Active phase | Temperature (C) | I | Reference | Comment |
---|---|---|---|---|---|
Packed | PEG-20M | 150. | 1420. | Tibor and Anna, 1971 | N2, Chromosorb W-AW; Column length: 2. m |
Packed | PEG-20M | 170. | 1425. | Tibor and Anna, 1971 | N2, Chromosorb W-AW; Column length: 2. m |

References

Olson, Hipsher, et al., 1947
Olson, W.T.; Hipsher, H.F.; Buess, C.M.; Goodman, I.A.; Hart, I.; Lamneck, J.H.; Gibbons, L.C.,
The Synthesis and Purification of Ethers,
J. Am. Chem. Soc., 1947, 69, 2451-4. [all data]
Perkin, 1896
Perkin, W.H.,
LXIX. On Magnetic Rotatory Power, especially of Aromatic Compounds,
J. Chem. Soc., 1896, 69, 1025-1257. [all data]
Stephenson and Malanowski, 1987
Stephenson, Richard M.; Malanowski, Stanislaw,
Handbook of the Thermodynamics of Organic Compounds, 1987, https://doi.org/10.1007/978-94-009-3173-2
. [all data]
Heinrich, Surovy, et al., 1965
Heinrich, J.; Surovy, J.; Dojcansky, J.,
Chem. Zvesti, 1965, 19, 462. [all data]
Boublik, Fried, et al., 1984
Boublik, T.; Fried, V.; Hala, E.,
The Vapour Pressures of Pure Substances: Selected Values of the Temperature Dependence of the Vapour Pressures of Some Pure Substances in the Normal and Low Pressure Region, 2nd ed., Elsevier, New York, 1984, 972. [all data]
Dewar, Ernstbrunner, et al., 1974
Dewar, P.S.; Ernstbrunner, E.; Gilmore, J.R.; Godfrey, M.; Mellor, J.M.,
Conformational analysis of alkyl aryl ethers and alkyl aryl sulphides by photoelectron spectroscopy,
Tetrahedron, 1974, 30, 2455. [all data]
Tibor and Anna, 1971
Tibor, T.; Anna, B.,
Gázkromatográfiás retenció és a kémiai szerkezet, I.,
Magy. Kem. Foly., 1971, 77, 576-587. [all data]