1,3-Benzodioxole
- Formula: C7H6O2
- Molecular weight: 122.1213
- IUPAC Standard InChIKey: FTNJQNQLEGKTGD-UHFFFAOYSA-N
- CAS Registry Number: 274-09-9
- Chemical structure:
View 3d structure (requires JavaScript / HTML 5) - Other names: Benzene, 1,2-(methylenedioxy)-; (Methylenedioxy)benzene; o-Methylenedioxybenzene; Benzene, 1,2-[methylenebis(oxy)]-; Benzodioxole; 1,2-(Methylenedioxy)benzene; 1,3-Dioxaindan; 1,3-Dioxindan; 3,4-Methylenedioxybenzene; 2H-1,3-Benzodioxole; NSC 30095; 1,3-benzodioxolane

Condensed phase thermochemistry data

Data compiled by: Hussein Y. Afeefy, Joel F. Liebman, and Stephen E. Stein
Quantity | Value | Units | Method | Reference | Comment |
---|---|---|---|---|---|
ΔcH°liquid | -3428. ± 2. | kJ/mol | Ccb | Cass, Fletcher, et al., 1958 | Corresponding ΔfHºliquid = -184. kJ/mol (simple calculation by NIST; no Washburn corrections) |

Phase change data

Data compiled as indicated in comments:
BS - Robert L. Brown and Stephen E. Stein
ALS - Hussein Y. Afeefy, Joel F. Liebman, and Stephen E. Stein
Quantity | Value | Units | Method | Reference | Comment |
---|---|---|---|---|---|
Tboil | 445.7 | K | N/A | Weast and Grasselli, 1989 | BS |
Quantity | Value | Units | Method | Reference | Comment |
ΔvapH° | 41.4 | kJ/mol | V | Cass, Fletcher, et al., 1958 | ALS |
Reduced pressure boiling point
Tboil (K) | Pressure (bar) | Reference | Comment |
---|---|---|---|
343. to 345. | 0.027 | Frinton Laboratories Inc., 1986 | BS |

Gas phase ion energetics data

Data compiled by: Sharon G. Lias, Rhoda D. Levin, and Sherif A. Kafafi
Ionization energy determinations
IE (eV) | Method | Reference | Comment |
---|---|---|---|
8.0 | PE | Anderson, Kollman, et al., 1979 | |
8.21 | PE | Anderson, Kollman, et al., 1979 | Vertical value |

Normal alkane RI, polar column, temperature ramp

Column type | Active phase | I | Reference | Comment |
---|---|---|---|---|
Capillary | DB-Wax | 1530. | Moon and Shibamoto, 2010 | 60. m/0.25 mm/0.50 μm, Helium, 40. C @ 5. min, 2. K/min, 210. C @ 70. min |

Normal alkane RI, polar column, custom temperature program

Column type | Active phase | I | Reference | Comment |
---|---|---|---|---|
Capillary | DB-Wax | 1531. | Peng, Yang, et al., 1991 | Program: not specified |

References

Cass, Fletcher, et al., 1958
Cass, R.C.; Fletcher, S.E.; Mortimer, C.T.; Quincey, P.G.; Springall, H.D.,
Heats of combustion and molecular structure. Part VI. The structure of some cyclic ethers of o-dihydroxybenzene,
J. Chem. Soc., 1958, 2595-2597. [all data]
Weast and Grasselli, 1989
CRC Handbook of Data on Organic Compounds, 2nd Editon, Weast,R.C and Grasselli, J.G., ed(s)., CRC Press, Inc., Boca Raton, FL, 1989, 1. [all data]
Frinton Laboratories Inc., 1986
Frinton Laboratories Inc.,
Catalog Number 11, Frinton Laboratories Inc., Vineland, NJ, 1986, 99. [all data]
Anderson, Kollman, et al., 1979
Anderson, G.M., III; Kollman, P.A.; Domelsmith, L.N.; Houk, K.N.,
Methoxy group nonplanarity in o-dimethoxybenzenes. Simple predictive models for conformations and rotational barriers in alkoxyaromatics,
J. Am. Chem. Soc., 1979, 101, 2344. [all data]
Moon and Shibamoto, 2010
Moon, J.-K.; Shibamoto, T.,
Formation of volatile chemicals from thermal degradation of less volatile cofee components: quinic acid, caffeic acid, and chlorogenic acid,
J. Agric. Food Chem., 2010, 58, 9, 5465-5470, https://doi.org/10.1021/jf1005148
. [all data]
Peng, Yang, et al., 1991
Peng, C.T.; Yang, Z.C.; Ding, S.F.,
Prediction of rentention idexes. II. Structure-retention index relationship on polar columns,
J. Chromatogr., 1991, 586, 1, 85-112, https://doi.org/10.1016/0021-9673(91)80028-F
. [all data]