1,2,3-Benzothiadiazole
- Formula: C6H4N2S
- Molecular weight: 136.174
- IUPAC Standard InChIKey: FNQJDLTXOVEEFB-UHFFFAOYSA-N
- CAS Registry Number: 273-77-8
- Chemical structure:
View 3d structure (requires JavaScript / HTML 5) - Permanent link for this species. Use this link for bookmarking this species for future reference.

Gas phase ion energetics data

Data compiled by: Sharon G. Lias, Rhoda D. Levin, and Sherif A. Kafafi
Ionization energy determinations
IE (eV) | Method | Reference | Comment |
---|---|---|---|
9.50 ± 0.05 | EI | Thorstad and Undheim, 1974 | |
9.15 | PE | Johnstone and Mellon, 1973 | Vertical value |

References

Thorstad and Undheim, 1974
Thorstad, O.; Undheim, K.,
Mass spectrometry of onium compounds. XXIV. Ionisation potential in structure analysis of pyridodiazo-oxides,
Chem. Scr., 1974, 6, 222. [all data]
Johnstone and Mellon, 1973
Johnstone, R.A.W.; Mellon, F.A.,
Photoelectron spectroscopy of sulphur-containing heteroaromatics and molecular orbital calculations,
J. Chem. Soc. Faraday Trans. 2, 1973, 69, 1155. [all data]