1H-1,2,3-Triazolo[4,5-b]pyridine
- Formula: C5H4N4
- Molecular weight: 120.1121
- IUPAC Standard InChIKey: VQNDBXJTIJKJPV-UHFFFAOYSA-N
- CAS Registry Number: 273-34-7
- Chemical structure:
View 3d structure (requires JavaScript / HTML 5) - Other names: 1,2,3-Triazolo(5,4-b)pyridine

Gas phase ion energetics data

Data compiled by: Sharon G. Lias, Rhoda D. Levin, and Sherif A. Kafafi
Ionization energy determinations
IE (eV) | Method | Reference |
---|---|---|
9.20 ± 0.05 | EI | Thorstad and Undheim, 1974 |

References

Thorstad and Undheim, 1974
Thorstad, O.; Undheim, K.,
Mass spectrometry of onium compounds. XXIV. Ionisation potential in structure analysis of pyridodiazo-oxides,
Chem. Scr., 1974, 6, 222. [all data]