Benzo[b]tellurophene
- Formula: C8H6Te
- Molecular weight: 229.73
- IUPAC Standard InChIKey: WDKYOIMDQCVVST-UHFFFAOYSA-N
- CAS Registry Number: 272-35-5
- Chemical structure:
View 3d structure (requires JavaScript / HTML 5) - Other names: Telluranaphthene

Gas phase ion energetics data

Data compiled by: Sharon G. Lias, Rhoda D. Levin, and Sherif A. Kafafi
Ionization energy determinations
IE (eV) | Method | Reference |
---|---|---|
7.76 ± 0.05 | PE | Muller, 1975 |

References

Muller, 1975
Muller, J.-F.,
287. Spectres photoelectroniques He(I) et He(II) du benzo[ b]selenophene et du benzo- [b]tellurophene,
Helv. Chim. Acta, 1975, 58, 2646. [all data]