Benzo[b]selenophene
- Formula: C8H6Se
- Molecular weight: 181.09
- IUPAC Standard InChIKey: BNRDGHFESOHOBF-UHFFFAOYSA-N
- CAS Registry Number: 272-30-0
- Chemical structure:
View 3d structure (requires JavaScript / HTML 5) - Other names: Selenanaphthene; Selenonaphthen; Selenonaphthene

Phase change data

Data compiled by: Robert L. Brown and Stephen E. Stein
Reduced pressure boiling point
Tboil (K) | Pressure (bar) | Reference |
---|---|---|
511.6 to 513. | 1.03 | Buckingham and Donaghy, 1982 |

Gas phase ion energetics data

Data compiled by: Sharon G. Lias, Rhoda D. Levin, and Sherif A. Kafafi
Ionization energy determinations
IE (eV) | Method | Reference |
---|---|---|
8.03 ± 0.05 | PE | Muller, 1975 |

References

Buckingham and Donaghy, 1982
Buckingham, J.; Donaghy, S.M.,
Dictionary of Organic Compounds: Fifth Edition, Chapman and Hall, New York, 1982, 1. [all data]
Muller, 1975
Muller, J.-F.,
287. Spectres photoelectroniques He(I) et He(II) du benzo[ b]selenophene et du benzo- [b]tellurophene,
Helv. Chim. Acta, 1975, 58, 2646. [all data]