Phenanthridine,6-phenyl-
- Formula: C19H13N
- Molecular weight: 255.3132
- IUPAC Standard InChIKey: XXWONCALJGBUFK-UHFFFAOYSA-N
- CAS Registry Number: 2720-93-6
- Chemical structure:
View 3d structure (requires JavaScript / HTML 5) - Permanent link for this species. Use this link for bookmarking this species for future reference.

Gas phase ion energetics data

Data compiled by: Sharon G. Lias, Rhoda D. Levin, and Sherif A. Kafafi
Ionization energy determinations
IE (eV) | Method | Reference | Comment |
---|---|---|---|
8.20 | PE | Schafer, Schweig, et al., 1974 | Vertical value |

References

Schafer, Schweig, et al., 1974
Schafer, W.; Schweig, A.; Bickelhaupt, F.; Vermeer, H.,
The electronic structure of a lambda3-phosphaphenanthrene; a direct indication of the similarity of electronic effects produced by sp2 hybridized carbon and phosphorus atoms,
Recl. Trav. Chim. Pays-Bas, 1974, 93, 1. [all data]