1H-Indazole
- Formula: C7H6N2
- Molecular weight: 118.1359
- IUPAC Standard InChIKey: BAXOFTOLAUCFNW-UHFFFAOYSA-N
- CAS Registry Number: 271-44-3
- Chemical structure:
View 3d structure (requires JavaScript / HTML 5) - Other names: Isoindazole; 1,2-Diazaindene; 1H-Benzopyrazole; 2-Azaindole; Indazole; Benzopyrazole

Condensed phase thermochemistry data

Data compiled as indicated in comments:
ALS - Hussein Y. Afeefy, Joel F. Liebman, and Stephen E. Stein
DH - Eugene S. Domalski and Elizabeth D. Hearing
Quantity | Value | Units | Method | Reference | Comment |
---|---|---|---|---|---|
ΔfH°solid | 151.9 ± 1.3 | kJ/mol | Ccb | Jimenez, Roux, et al., 1987 | see Jimenez, Roux, et al., 1986; ALS |
ΔfH°solid | 166.5 ± 3.7 | kJ/mol | Ccb | Faour and Akasheh, 1985 | ALS |
Quantity | Value | Units | Method | Reference | Comment |
ΔcH°solid | -3764.0 ± 0.9 | kJ/mol | Ccb | Jimenez, Roux, et al., 1987 | see Jimenez, Roux, et al., 1986; ALS |
ΔcH°solid | -3778.6 ± 3.5 | kJ/mol | Ccb | Faour and Akasheh, 1985 | ALS |
ΔcH°solid | -3764. | kJ/mol | Ccb | Zimmerman and Geisenfelder, 1961 | ALS |
Constant pressure heat capacity of solid
Cp,solid (J/mol*K) | Temperature (K) | Reference | Comment |
---|---|---|---|
128.8 | 298.15 | Jimenez, Roux, et al., 1987 | Cp given as 1.09 J K-1 g-1.; DH |

Phase change data

Data compiled as indicated in comments:
BS - Robert L. Brown and Stephen E. Stein
TRC - Thermodynamics Research Center, NIST Boulder Laboratories, Chris Muzny director
ALS - Hussein Y. Afeefy, Joel F. Liebman, and Stephen E. Stein
DRB - Donald R. Burgess, Jr.
AC - William E. Acree, Jr., James S. Chickos
Quantity | Value | Units | Method | Reference | Comment |
---|---|---|---|---|---|
Tfus | 419.3 | K | N/A | Rondestvedt and Blanchard, 1955 | Uncertainty assigned by TRC = 0.6 K; TRC |
Quantity | Value | Units | Method | Reference | Comment |
ΔsubH° | 91.1 ± 0.2 | kJ/mol | V | Jimenez, Roux, et al., 1987 | see Jimenez, Roux, et al., 1986; ALS |
ΔsubH° | 91.1 | kJ/mol | N/A | Jimenez, Roux, et al., 1987 | DRB |
ΔsubH° | 91.1 ± 0.2 | kJ/mol | N/A | Jimenez, Roux, et al., 1987 | See also Jimenez, Roux, et al., 1986, 2.; AC |
ΔsubH° | 87.7 | kJ/mol | N/A | Faour and Akasheh, 1985 | DRB |
ΔsubH° | 97.1 | kJ/mol | V | Zimmerman and Geisenfelder, 1961 | ALS |
Reduced pressure boiling point
Tboil (K) | Pressure (bar) | Reference | Comment |
---|---|---|---|
543.2 | 0.991 | Aldrich Chemical Company Inc., 1990 | BS |
Enthalpy of sublimation
ΔsubH (kJ/mol) | Temperature (K) | Method | Reference | Comment |
---|---|---|---|---|
90.9 ± 0.2 | 318. | ME | Jimenez, Roux, et al., 1987 | Based on data from 308. to 317. K.; AC |

Reaction thermochemistry data

Data compiled by: John E. Bartmess
Individual Reactions
C7H5N2- + =
By formula: C7H5N2- + H+ = C7H6N2
Quantity | Value | Units | Method | Reference | Comment |
---|---|---|---|---|---|
ΔrH° | 1457. ± 8.8 | kJ/mol | G+TS | Catalan, Claramunt, et al., 1988 | gas phase |
Quantity | Value | Units | Method | Reference | Comment |
ΔrG° | 1425. ± 8.4 | kJ/mol | IMRE | Catalan, Claramunt, et al., 1988 | gas phase |

Gas phase ion energetics data

Data evaluated as indicated in comments:
HL - Edward P. Hunter and Sharon G. Lias
Data compiled as indicated in comments:
B - John E. Bartmess
LLK - Sharon G. Lias, Rhoda D. Levin, and Sherif A. Kafafi
Quantity | Value | Units | Method | Reference | Comment |
---|---|---|---|---|---|
Proton affinity (review) | 900.8 | kJ/mol | N/A | Hunter and Lias, 1998 | HL |
Quantity | Value | Units | Method | Reference | Comment |
Gas basicity | 868.9 | kJ/mol | N/A | Hunter and Lias, 1998 | HL |
Ionization energy determinations
IE (eV) | Method | Reference | Comment |
---|---|---|---|
8.35 | PE | Kovac, Klasinc, et al., 1980 | LLK |
8.35 | PE | Kovac, Klasinc, et al., 1980 | Vertical value; LLK |
De-protonation reactions
C7H5N2- + =
By formula: C7H5N2- + H+ = C7H6N2
Quantity | Value | Units | Method | Reference | Comment |
---|---|---|---|---|---|
ΔrH° | 1457. ± 8.8 | kJ/mol | G+TS | Catalan, Claramunt, et al., 1988 | gas phase; B |
Quantity | Value | Units | Method | Reference | Comment |
ΔrG° | 1425. ± 8.4 | kJ/mol | IMRE | Catalan, Claramunt, et al., 1988 | gas phase; B |

Normal alkane RI, non-polar column, temperature ramp

Column type | Active phase | I | Reference | Comment |
---|---|---|---|---|
Capillary | Ultra-1 | 1260. | Okumura, 1991 | 25. m/0.32 mm/0.25 μm, He, 3. K/min; Tstart: 80. C; Tend: 260. C |

Normal alkane RI, polar column, custom temperature program

Column type | Active phase | I | Reference | Comment |
---|---|---|---|---|
Capillary | DB-Wax | 2556. | Peng, Yang, et al., 1991 | Program: not specified |

Gas phase thermochemistry data

Data compiled by: Hussein Y. Afeefy, Joel F. Liebman, and Stephen E. Stein

Quantity Value Units Method Reference Comment
Δfgas243.0 ± 1.3kJ/molCcbJimenez, Roux, et al., 1987see Jimenez, Roux, et al., 1986
Δfgas254.2 ± 4.6kJ/molCcbFaour and Akasheh, 1985

References

Jimenez, Roux, et al., 1987
Jimenez, P.; Roux, M.V.; Turrion, C.,
Thermochemical properties of N-heterocyclic compounds. I. Enthalpies of combustion, vapour pressures and enthalpies of sublimation, and enthalpies of formation of pyrazole, imidazole, indazole, and benzimidazole,
J. Chem. Thermodyn., 1987, 19, 985-992. [all data]
Jimenez, Roux, et al., 1986
Jimenez, P.; Roux, M.V.; Turrion, C.; Gomis, F.,
Thermochemical properties of some N-heterocyclic compounds,
J. Calorim. Anal. Therm. Thermodyn. Chim., 1986, 17, 469-470. [all data]
Faour and Akasheh, 1985
Faour, M.; Akasheh, T.S.,
Heat of combustion of some N-heterocycle compounds. Part 1,
J. Chem. Soc. Perkin Trans. 2, 1985, 811-713. [all data]
Zimmerman and Geisenfelder, 1961
Zimmerman, H.; Geisenfelder, H.,
Uber die Mesomerieenergie von Azolen,
Z. Electrochem., 1961, 65, 368-371. [all data]
Rondestvedt and Blanchard, 1955
Rondestvedt, C.S.; Blanchard, H.S.,
Arylation of Unsaturated Systems by Free Radicals I. Arylation of Alkylbenzenes,
J. Am. Chem. Soc., 1955, 77, 1769. [all data]
Jimenez, Roux, et al., 1986, 2
Jimenez, P.; Roux, M.V.; Turrion, C.; Gomis, F.,
Thermochemical properties of some N-heterocyclic compounds,
J. Calorim. Anal. Therm. Thermodyn. Chim., 1986, 17, 469. [all data]
Aldrich Chemical Company Inc., 1990
Aldrich Chemical Company Inc.,
Catalog Handbook of Fine Chemicals, Aldrich Chemical Company, Inc., Milwaukee WI, 1990, 1. [all data]
Catalan, Claramunt, et al., 1988
Catalan, J.; Claramunt, R.M.; Elguero, J.; Menedez, M.; Anvia, F.; Quian, J.H.; Taagepera, M.; Taft, R.W.,
Basicity and Acidity of Azoles. The Annelation Effect in Azoles.,
J. Am. Chem. Soc., 1988, 110, 13, 4107, https://doi.org/10.1021/ja00221a001
. [all data]
Hunter and Lias, 1998
Hunter, E.P.; Lias, S.G.,
Evaluated Gas Phase Basicities and Proton Affinities of Molecules: An Update,
J. Phys. Chem. Ref. Data, 1998, 27, 3, 413-656, https://doi.org/10.1063/1.556018
. [all data]
Kovac, Klasinc, et al., 1980
Kovac, B.; Klasinc, L.; Stanovnik, B.; Tisler, M.,
Photoelectron spectroscopy of J. Heterocycl. Chem.. Azaindenes azaindolizines (1),
J. Heterocycl. Chem., 1980, 17, 689. [all data]
Okumura, 1991
Okumura, T.,
retention indices of environmental chemicals on methyl silicone capillary column,
Journal of Environmental Chemistry (Japan), 1991, 1, 2, 333-358, https://doi.org/10.5985/jec.1.333
. [all data]
Peng, Yang, et al., 1991
Peng, C.T.; Yang, Z.C.; Ding, S.F.,
Prediction of rentention idexes. II. Structure-retention index relationship on polar columns,
J. Chromatogr., 1991, 586, 1, 85-112, https://doi.org/10.1016/0021-9673(91)80028-F
. [all data]