2,5-Difluorophenol
- Formula: C6H4F2O
- Molecular weight: 130.0922
- IUPAC Standard InChIKey: INXKVYFOWNAVMU-UHFFFAOYSA-N
- CAS Registry Number: 2713-31-7
- Chemical structure:
View 3d structure (requires JavaScript / HTML 5) - Other names: Phenol,2,5-difluoro-

Phase change data

Data compiled by: William E. Acree, Jr., James S. Chickos
Quantity | Value | Units | Method | Reference | Comment |
---|---|---|---|---|---|
ΔsubH° | 68.0 ± 1.4 | kJ/mol | C | Ribeiro da Silva and Lobo Ferreira, 2010 |

Gas phase ion energetics data

Data compiled by: Sharon G. Lias, Rhoda D. Levin, and Sherif A. Kafafi
Ionization energy determinations
IE (eV) | Method | Reference | Comment |
---|---|---|---|
9.10 ± 0.02 | PE | Maier, Marthaler, et al., 1980 | Vertical value |

References

Ribeiro da Silva and Lobo Ferreira, 2010
Ribeiro da Silva, Manuel A.V.; Lobo Ferreira, Ana I.M.C.,
Calorimetric and computational thermochemical study of difluorophenol isomers,
The Journal of Chemical Thermodynamics, 2010, 42, 2, 182-188, https://doi.org/10.1016/j.jct.2009.07.011
. [all data]
Maier, Marthaler, et al., 1980
Maier, J.P.; Marthaler, O.; Mohraz, M.,
Emission spectra of the cations of some fluorosubstituted phenols in the gaseous phase,
J. Electron Spectrosc. Relat. Phenom., 1980, 19, 11. [all data]