Ethyne, fluoro-
- Formula: C2HF
- Molecular weight: 44.0277
- IUPAC Standard InChIKey: IAWCIZWLKMTPLL-UHFFFAOYSA-N
- CAS Registry Number: 2713-09-9
- Chemical structure:
View 3d structure (requires JavaScript / HTML 5) - Other names: Fluoroacetylene; Acetylene, fluoro-; Monofluoroacetylene; HC≡CF; Fluoroethyne; C2HF

Gas phase thermochemistry data

Quantity | Value | Units | Method | Reference | Comment |
---|---|---|---|---|---|
ΔfH°gas | 125.52 | kJ/mol | Review | Chase, 1998 | Data last reviewed in December, 1967 |
Quantity | Value | Units | Method | Reference | Comment |
S°gas,1 bar | 231.61 | J/mol*K | Review | Chase, 1998 | Data last reviewed in December, 1967 |
Gas Phase Heat Capacity (Shomate Equation)
Cp° = A + B*t + C*t2 + D*t3 +
E/t2
H° − H°298.15= A*t + B*t2/2 +
C*t3/3 + D*t4/4 − E/t + F − H
S° = A*ln(t) + B*t + C*t2/2 + D*t3/3 −
E/(2*t2) + G
Cp = heat capacity (J/mol*K)
H° = standard enthalpy (kJ/mol)
S° = standard entropy (J/mol*K)
t = temperature (K) / 1000.
View plot Requires a JavaScript / HTML 5 canvas capable browser.
Temperature (K) | 298. to 1400. | 1400. to 6000. |
---|---|---|
A | 49.24359 | 79.13116 |
B | 38.22628 | 4.001829 |
C | -16.60345 | -0.732129 |
D | 2.951377 | 0.046889 |
E | -0.617115 | -10.76882 |
F | 107.2087 | 79.92528 |
G | 277.0423 | 299.4116 |
H | 125.5200 | 125.5200 |
Reference | Chase, 1998 | Chase, 1998 |
Comment | Data last reviewed in December, 1967 | Data last reviewed in December, 1967 |

Reaction thermochemistry data

Data compiled by: John E. Bartmess
Individual Reactions
C2F- + =
Quantity | Value | Units | Method | Reference | Comment |
---|---|---|---|---|---|
ΔrH° | <1540. ± 79. | kJ/mol | D-EA | Thynne and MacNiel, 1971 | gas phase; From CH2=CF2 |
Quantity | Value | Units | Method | Reference | Comment |
ΔrG° | <1510. ± 79. | kJ/mol | H-TS | Thynne and MacNiel, 1971 | gas phase; From CH2=CF2 |

Gas phase ion energetics data

Data evaluated as indicated in comments:
HL - Edward P. Hunter and Sharon G. Lias
L - Sharon G. Lias
Data compiled as indicated in comments:
B - John E. Bartmess
LLK - Sharon G. Lias, Rhoda D. Levin, and Sherif A. Kafafi
RDSH - Henry M. Rosenstock, Keith Draxl, Bruce W. Steiner, and John T. Herron
Quantity | Value | Units | Method | Reference | Comment |
---|---|---|---|---|---|
IE (evaluated) | 11.26 | eV | N/A | N/A | L |
Quantity | Value | Units | Method | Reference | Comment |
Proton affinity (review) | 686. | kJ/mol | N/A | Hunter and Lias, 1998 | HL |
Quantity | Value | Units | Method | Reference | Comment |
Gas basicity | 661.3 | kJ/mol | N/A | Hunter and Lias, 1998 | HL |
Ionization energy determinations
IE (eV) | Method | Reference | Comment |
---|---|---|---|
11.26 | PE | Bieri, Schmelzer, et al., 1980 | LLK |
11.5 ± 0.1 | EI | Kloster-Jensen, Pascual, et al., 1970 | RDSH |
11.26 | PE | Haink, Heilbronner, et al., 1970 | RDSH |
Appearance energy determinations
Ion | AE (eV) | Other Products | Method | Reference | Comment |
---|---|---|---|---|---|
CF+ | 17.0 ± 0.1 | CH | EI | Kloster-Jensen, Pascual, et al., 1970 | RDSH |
CH+ | 19.2 ± 0.2 | CF | EI | Kloster-Jensen, Pascual, et al., 1970 | RDSH |
De-protonation reactions
C2F- + =
Quantity | Value | Units | Method | Reference | Comment |
---|---|---|---|---|---|
ΔrH° | <1540. ± 79. | kJ/mol | D-EA | Thynne and MacNiel, 1971 | gas phase; From CH2=CF2; B |
Quantity | Value | Units | Method | Reference | Comment |
ΔrG° | <1510. ± 79. | kJ/mol | H-TS | Thynne and MacNiel, 1971 | gas phase; From CH2=CF2; B |

Vibrational and/or electronic energy levels

Data compiled by: Takehiko Shimanouchi

Symmetry:   C∞ν     Symmetry Number σ = 1

 Sym.   No   Approximate   Selected Freq.  Infrared   Raman   Comments
 Species   type of mode   Value   Rating   Value  Phase  Value  Phase

σ+ 1 CH str 3355  B 3355 VS gas
σ+ 2 CC str 2255  B 2255 VS gas
σ+ 3 CF str 1055  B 1055 VS gas
π 4 CH bend 578  B 578 VS gas
π 5 CCF bend 367  B 367 M gas

Source: Shimanouchi, 1972

References

Chase, 1998
Chase, M.W., Jr.,
NIST-JANAF Themochemical Tables, Fourth Edition,
J. Phys. Chem. Ref. Data, Monograph 9, 1998, 1-1951. [all data]
Thynne and MacNiel, 1971
Thynne, J.C.J.; MacNiel, K.A.G.,
Negative ion formation by ethylene and 1,1-difluoroethylene,
J. Phys. Chem., 1971, 75, 2584. [all data]
Hunter and Lias, 1998
Hunter, E.P.; Lias, S.G.,
Evaluated Gas Phase Basicities and Proton Affinities of Molecules: An Update,
J. Phys. Chem. Ref. Data, 1998, 27, 3, 413-656, https://doi.org/10.1063/1.556018
. [all data]
Bieri, Schmelzer, et al., 1980
Bieri, G.; Schmelzer, A.; Asbrink, L.; Jonsson, M.,
Fluorine and the fluoroderivatives of acetylene and diacetylene studied by 30.4 nm He(II) photoelectron spectroscopy,
Chem. Phys., 1980, 49, 213. [all data]
Kloster-Jensen, Pascual, et al., 1970
Kloster-Jensen, E.; Pascual, C.; Vogt, J.,
Mass spectrometric studies of mono- and di-haloacetylenes,,
Helv. Chim. Acta, 1970, 53, 2109. [all data]
Haink, Heilbronner, et al., 1970
Haink, H.J.; Heilbronner, E.; Hornung, V.; KlosterJensen, E.,
Die Photoelektron-Spektren der Monohalogenacetylene,
Helv. Chim. Acta, 1970, 53, 1073. [all data]