Nitrosyl chloride
- Formula: ClNO
- Molecular weight: 65.459
- IUPAC Standard InChIKey: VPCDQGACGWYTMC-UHFFFAOYSA-N
- CAS Registry Number: 2696-92-6
- Chemical structure:
View 3d structure (requires JavaScript / HTML 5) - Isotopologues:
- Other names: Nitrogen chloride oxide (NOCl); Nitrogen oxide chloride (NOCl); Nitrogen oxychloride; Nitrogen oxychloride (NOCl); NOCl; Nitrosyl chloride ((NO)Cl); UN 1069; ONCl; Nitrosonium chloride

Gas phase thermochemistry data

Quantity | Value | Units | Method | Reference | Comment |
---|---|---|---|---|---|
ΔfH°gas | 51.71 | kJ/mol | Review | Chase, 1998 | Data last reviewed in December, 1972 |
Quantity | Value | Units | Method | Reference | Comment |
S°gas,1 bar | 261.68 | J/mol*K | Review | Chase, 1998 | Data last reviewed in December, 1972 |
Gas Phase Heat Capacity (Shomate Equation)
Cp° = A + B*t + C*t2 + D*t3 +
E/t2
H° − H°298.15= A*t + B*t2/2 +
C*t3/3 + D*t4/4 − E/t + F − H
S° = A*ln(t) + B*t + C*t2/2 + D*t3/3 −
E/(2*t2) + G
Cp = heat capacity (J/mol*K)
H° = standard enthalpy (kJ/mol)
S° = standard entropy (J/mol*K)
t = temperature (K) / 1000.
View plot Requires a JavaScript / HTML 5 canvas capable browser.
Temperature (K) | 298. to 1000. | 1000. to 6000. |
---|---|---|
A | 39.09814 | 56.35220 |
B | 27.16847 | 1.799878 |
C | -13.31935 | -0.121618 |
D | 2.074453 | 0.015128 |
E | -0.131591 | -3.193999 |
F | 38.52175 | 27.00153 |
G | 300.7292 | 318.6509 |
H | 51.71424 | 51.71424 |
Reference | Chase, 1998 | Chase, 1998 |
Comment | Data last reviewed in December, 1972 | Data last reviewed in December, 1972 |

Phase change data

Data compiled as indicated in comments:
AC - William E. Acree, Jr., James S. Chickos
Enthalpy of vaporization
ΔvapH (kJ/mol) | Temperature (K) | Reference | Comment |
---|---|---|---|
25.3 | 230. | Partington and Whynes, 1949 | Based on data from 203. to 258. K.; AC |
Antoine Equation Parameters
log10(P) = A − (B / (T + C))
P = vapor pressure (bar)
T = temperature (K)
View plot Requires a JavaScript / HTML 5 canvas capable browser.
Temperature (K) | A | B | C | Reference | Comment |
---|---|---|---|---|---|
213.0 to 266.8 | 4.63068 | 1151.544 | -17.863 | Stull, 1947 | Coefficents calculated by NIST from author's data. |

Reaction thermochemistry data

Data compiled by: Hussein Y. Afeefy, Joel F. Liebman, and Stephen E. Stein
Individual Reactions
By formula: CH3NO2 + HCl = ClNO + CH4O
Quantity | Value | Units | Method | Reference | Comment |
---|---|---|---|---|---|
ΔrH° | 8.95 ± 0.84 | kJ/mol | Eqk | Ray and Gershon, 1962 | gas phase |

Gas phase ion energetics data

Data evaluated as indicated in comments:
L - Sharon G. Lias
Data compiled as indicated in comments:
LBLHLM - Sharon G. Lias, John E. Bartmess, Joel F. Liebman, John L. Holmes, Rhoda D. Levin, and W. Gary Mallard
LLK - Sharon G. Lias, Rhoda D. Levin, and Sherif A. Kafafi
Quantity | Value | Units | Method | Reference | Comment |
---|---|---|---|---|---|
IE (evaluated) | 10.90 ± 0.03 | eV | N/A | N/A | L |
Ionization energy determinations
IE (eV) | Method | Reference | Comment |
---|---|---|---|
12.7 | EI | Binnewies, 1983 | LBLHLM |
10.9 ± 0.5 | PE | Alderdice and Dixon, 1977 | LLK |
10.87 ± 0.01 | PE | Abbas, Dyke, et al., 1976 | LLK |
10.94 | PE | Frost, Lee, et al., 1975 | LLK |
Appearance energy determinations
Ion | AE (eV) | Other Products | Method | Reference | Comment |
---|---|---|---|---|---|
NO+ | 11.0 ± 0.02 | Cl | EI | Syrvatka and Gil'burd, 1973 | LLK |

References

Chase, 1998
Chase, M.W., Jr.,
NIST-JANAF Themochemical Tables, Fourth Edition,
J. Phys. Chem. Ref. Data, Monograph 9, 1998, 1-1951. [all data]
Partington and Whynes, 1949
Partington, J.R.; Whynes, A.L.,
The Vapor Pressure of Nitrosyl Chloride.,
J. Phys. Chem., 1949, 53, 4, 500-505, https://doi.org/10.1021/j150469a006
. [all data]
Stull, 1947
Stull, Daniel R.,
Vapor Pressure of Pure Substances. Organic and Inorganic Compounds,
Ind. Eng. Chem., 1947, 39, 4, 517-540, https://doi.org/10.1021/ie50448a022
. [all data]
Ray and Gershon, 1962
Ray, J.D.; Gershon, A.A.,
The heat of formation of gaseous methyl nitrite,
J. Phys. Chem., 1962, 66, 1750-1752. [all data]
Binnewies, 1983
Binnewies, M.,
Bildung und stabilitat von gasformigem AsOCl und SbOCl massenspektrometrische untersuchungen,
Z. Anorg. Allg. Chem., 1983, 505, 32. [all data]
Alderdice and Dixon, 1977
Alderdice, D.S.; Dixon, R.N.,
Photoelectron spectra of nitrosyl halides,
J. Chem. Soc. Faraday Trans. 2, 1977, 73, 245. [all data]
Abbas, Dyke, et al., 1976
Abbas, M.I.; Dyke, J.M.; Morris, A.,
Photoelectron spectrum of nitrosyl chloride,
J. Chem. Soc. Faraday Trans. 2, 1976, 72, 814. [all data]
Frost, Lee, et al., 1975
Frost, D.C.; Lee, S.T.; McDowell, C.A.; Westwood, N.P.C.,
Photoelectron spectroscopic studies of some nitrosyl and nitryl halides nitric acid,
J. Electron Spectrosc. Relat. Phenom., 1975, 7, 331. [all data]
Syrvatka and Gil'burd, 1973
Syrvatka, B.G.; Gil'burd, M.M.,
Mass-spectrometric study of trifluoronitrosomethane,
Russ. J. Phys. Chem., 1973, 47, 1215. [all data]