Methanone, 2-furanylphenyl-
- Formula: C11H8O2
- Molecular weight: 172.1800
- IUPAC Standard InChIKey: CRLNTRZMHKNJSR-UHFFFAOYSA-N
- CAS Registry Number: 2689-59-0
- Chemical structure:
View 3d structure (requires JavaScript / HTML 5) - Permanent link for this species. Use this link for bookmarking this species for future reference.

Phase change data

Data compiled by: Robert L. Brown and Stephen E. Stein
Quantity | Value | Units | Method | Reference | Comment |
---|---|---|---|---|---|
Tboil | 558.2 | K | N/A | Weast and Grasselli, 1989 |

Gas phase ion energetics data

Data compiled by: Sharon G. Lias, Rhoda D. Levin, and Sherif A. Kafafi
Ionization energy determinations
IE (eV) | Method | Reference |
---|---|---|
9.1 ± 0.1 | EI | Grutzmacher and Schubert, 1979 |
Appearance energy determinations
Ion | AE (eV) | Other Products | Method | Reference | Comment |
---|---|---|---|---|---|
C5H3O2+ | 12.4 ± 0.1 | C6H5 | EI | Grutzmacher and Schubert, 1979 | |
C7H5O+ | 12.3 ± 0.1 | C4H3O | EI | Grutzmacher and Schubert, 1979 |

References

Weast and Grasselli, 1989
CRC Handbook of Data on Organic Compounds, 2nd Editon, Weast,R.C and Grasselli, J.G., ed(s)., CRC Press, Inc., Boca Raton, FL, 1989, 1. [all data]
Grutzmacher and Schubert, 1979
Grutzmacher, H.-F.; Schubert, R.,
Substituent effects in the mass spectra of benzoyl hetarenes,
Org. Mass Spectrom., 1979, 14, 567. [all data]
Lang (editor), 1961
Lang (editor), L.,
Absorption Spectra in the Ultraviolet and Visible Region, 1961, 2, 353. [all data]