Benzene,2-ethoxy-1,3-dimethyl-
- Formula: C10H14O
- Molecular weight: 150.2176
- IUPAC Standard InChIKey: HCEKYXXNVJXAIF-UHFFFAOYSA-N
- CAS Registry Number: 26620-08-6
- Chemical structure:
View 3d structure (requires JavaScript / HTML 5) - Permanent link for this species. Use this link for bookmarking this species for future reference.

Gas phase ion energetics data

Data compiled by: Sharon G. Lias, Rhoda D. Levin, and Sherif A. Kafafi
Ionization energy determinations
IE (eV) | Method | Reference | Comment |
---|---|---|---|
8.49 | PE | Dewar, Ernstbrunner, et al., 1974 | Vertical value |

Van Den Dool and Kratz RI, non-polar column, temperature ramp

Column type | Active phase | I | Reference | Comment |
---|---|---|---|---|
Capillary | SE-30 | 1308. | bin Jantan, Ayop, et al., 2002 | 25. m/0.25 mm/0.25 μm, N2, 60. C @ 10. min, 3. K/min, 180. C @ 10. min |

References

Dewar, Ernstbrunner, et al., 1974
Dewar, P.S.; Ernstbrunner, E.; Gilmore, J.R.; Godfrey, M.; Mellor, J.M.,
Conformational analysis of alkyl aryl ethers and alkyl aryl sulphides by photoelectron spectroscopy,
Tetrahedron, 1974, 30, 2455. [all data]
bin Jantan, Ayop, et al., 2002
bin Jantan, I.; Ayop, N.; Hiong, A.B.; Ahmad, A.S.,
Chemical composition of the essential oils of Cinnamomum cordatum Kosterm,
Flavour Fragr. J., 2002, 17, 3, 212-214, https://doi.org/10.1002/ffj.1075
. [all data]