Benzene, 1-chloro-3-ethoxy-
- Formula: C8H9ClO
- Molecular weight: 156.609
- IUPAC Standard InChIKey: HNMYSCABMYNGTP-UHFFFAOYSA-N
- CAS Registry Number: 2655-83-6
- Chemical structure:
View 3d structure (requires JavaScript / HTML 5) - Other names: Phenetole, m-chloro-; m-Chlorophenyl ethyl ether; 1-chloro-3-ethoxybenzene

Gas phase ion energetics data

Data compiled by: Henry M. Rosenstock, Keith Draxl, Bruce W. Steiner, and John T. Herron
Ionization energy determinations
IE (eV) | Method | Reference |
---|---|---|
8.59 ± 0.15 | EI | McLafferty and Schiff, 1969 |
Appearance energy determinations
Ion | AE (eV) | Other Products | Method | Reference | Comment |
---|---|---|---|---|---|
C6H5OCl+ | 10.70 ± 0.15 | C2H4 | EI | McLafferty and Schiff, 1969 |

References

McLafferty and Schiff, 1969
McLafferty, F.W.; Schiff, L.J.,
The structure of [YC6H5O]+ ions in the spectra of aryl alkyl ethers,
Org. Mass Spectrom., 1969, 2, 757. [all data]