N-amyl aniline
- Formula: C11H17N
- Molecular weight: 163.2594
- IUPAC Standard InChIKey: UMNSMBWAESLVOC-UHFFFAOYSA-N
- CAS Registry Number: 2655-27-8
- Chemical structure:
View 3d structure (requires JavaScript / HTML 5) - Other names: N-pentylaniline

Phase change data

Data compiled by: Thermodynamics Research Center, NIST Boulder Laboratories, Chris Muzny director
Quantity | Value | Units | Method | Reference | Comment |
---|---|---|---|---|---|
Tboil | 531.15 | K | N/A | Hoffmann, 1850 | Uncertainty assigned by TRC = 6. K |

Gas phase ion energetics data

Data compiled by: Henry M. Rosenstock, Keith Draxl, Bruce W. Steiner, and John T. Herron
Ionization energy determinations
IE (eV) | Method | Reference |
---|---|---|
7.5 | CTS | Briegleb and Czekalla, 1959 |

References

Hoffmann, 1850
Hoffmann, A.W.,
Researches Regarding Molecular Constitution of the Volatile Org. Bases,
J. Chem. Soc., 1850, 3, 279. [all data]
Briegleb and Czekalla, 1959
Briegleb, G.; Czekalla, J.,
Die Bestimmung von lonisierungsenergien aus den Spektren von Elektronenubergangskomplexen,
Z.Elektrochem., 1959, 63, 6. [all data]