Sulfoxide, isopropyl methyl
- Formula: C4H10OS
- Molecular weight: 106.187
- IUPAC Standard InChIKey: KBGDIHYLFZNUNL-UHFFFAOYSA-N
- CAS Registry Number: 26547-92-2
- Chemical structure:
View 3d structure (requires JavaScript / HTML 5) - Species with the same structure:

Gas phase ion energetics data

Data compiled by: Sharon G. Lias, Rhoda D. Levin, and Sherif A. Kafafi
Appearance energy determinations
Ion | AE (eV) | Other Products | Method | Reference | Comment |
---|---|---|---|---|---|
C3H5+ | 12.4 ± 0.1 | ? | EI | Potzinger, Stracke, et al., 1975 | |
C3H7+ | 10.60 ± 0.11 | CH3SO | EI | Potzinger, Stracke, et al., 1975 |

References

Potzinger, Stracke, et al., 1975
Potzinger, P.; Stracke, H.-U.; Kupper, W.; Gollnick, K.,
Ionisierungs- und Auftrittspotentialmessungen an Dialkylsulfoxiden,
Z. Naturforsch. A:, 1975, 30, 340. [all data]