Phosphine, bis(diethylamino)-ethyl-
- Formula: C10H25N2P
- Molecular weight: 204.2927
- IUPAC Standard InChIKey: UPPMICTXNFKBNF-UHFFFAOYSA-N
- CAS Registry Number: 26546-68-9
- Chemical structure:
View 3d structure (requires JavaScript / HTML 5) - Permanent link for this species. Use this link for bookmarking this species for future reference.

Gas phase ion energetics data

Data compiled by: Sharon G. Lias, John E. Bartmess, Joel F. Liebman, John L. Holmes, Rhoda D. Levin, and W. Gary Mallard
Ionization energy determinations
IE (eV) | Method | Reference | Comment |
---|---|---|---|
7.60 | PE | Zverev, Vakar, et al., 1986 | Vertical value |

References

Zverev, Vakar, et al., 1986
Zverev, V.V.; Vakar, V.M.; Villem, Y.Y.; Villen, N.V.; Karelov, A.A.,
Photoelectron spectra and electronic structures of organophosphorus compounds. Timethylsilyl phosphites and amidophosphites,
J. Gen. Chem. USSR, 1986, 56, 1807. [all data]