1-Bromo-2-iodoacetylene
- Formula: C2BrI
- Molecular weight: 230.830
- IUPAC Standard InChIKey: LKVRROKBWNSECY-UHFFFAOYSA-N
- CAS Registry Number: 26395-29-9
- Chemical structure:
View 3d structure (requires JavaScript / HTML 5) - Permanent link for this species. Use this link for bookmarking this species for future reference.

Gas phase ion energetics data

Data compiled by: Henry M. Rosenstock, Keith Draxl, Bruce W. Steiner, and John T. Herron
Ionization energy determinations
IE (eV) | Method | Reference |
---|---|---|
9.4 ± 0.1 | EI | Kloster-Jensen, Pascual, et al., 1970 |
9.34 | PE | Heilbronner, Hornung, et al., 1970 |
Appearance energy determinations
Ion | AE (eV) | Other Products | Method | Reference | Comment |
---|---|---|---|---|---|
CBr+ | 16.9 ± 0.1 | CI | EI | Kloster-Jensen, Pascual, et al., 1970 | |
CI+ | 16.9 ± 0.1 | CBr | EI | Kloster-Jensen, Pascual, et al., 1970 |

Vibrational and/or electronic energy levels

Data compiled by: Takehiko Shimanouchi
Symmetry: Cxν Symmetry Number σ = 1
Sym. | No | Approximate | Selected Freq. | Infrared | Raman | Comments | ||||
---|---|---|---|---|---|---|---|---|---|---|
Species | type of mode | Value | Rating | Value | Phase | Value | Phase | |||
σ+ | 1 | CC str | 2166 | B | 2166 S | gas | 2153 VS | solid solid | ||
σ+ | 2 | CBr str | 782 | C | 782 M | gas | 775 VW | solid solid | ||
σ+ | 3 | CI str | 222 | D | 222 M p | solid solid | ||||
π | 4 | CBr bend | 304 | D | 304 VS dp | solid solid | ||||
π | 5 | CI bend | 122 | B | 122 S | gas | ||||
Source: Shimanouchi, 1972

References

Kloster-Jensen, Pascual, et al., 1970
Kloster-Jensen, E.; Pascual, C.; Vogt, J.,
Mass spectrometric studies of mono- and di-haloacetylenes,,
Helv. Chim. Acta, 1970, 53, 2109. [all data]
Heilbronner, Hornung, et al., 1970
Heilbronner, E.; Hornung, V.; Kloster-Jensen, E.,
Die Photoelektron-Spektren der Dihalogen-acetylene,
Helv. Chim. Acta, 1970, 53, 331. [all data]
Shimanouchi, 1972
Shimanouchi, T.,
Tables of Molecular Vibrational Frequencies Consolidated Volume II,
J. Phys. Chem. Ref. Data, 1972, 6, 3, 993-1102. [all data]