Tetramethylcyclopropene
- Formula: C7H12
- Molecular weight: 96.1702
- IUPAC Standard InChIKey: ONAPRVZODHCPOU-UHFFFAOYSA-N
- CAS Registry Number: 26385-95-5
- Chemical structure:
View 3d structure (requires JavaScript / HTML 5) - Permanent link for this species. Use this link for bookmarking this species for future reference.

Gas phase ion energetics data

Data compiled by: Sharon G. Lias, Rhoda D. Levin, and Sherif A. Kafafi
Ionization energy determinations
IE (eV) | Method | Reference | Comment |
---|---|---|---|
8.2 | PE | Plemenkov, Villem, et al., 1981 | |
8.58 | PE | Plemenkov, Villem, et al., 1981 | Vertical value |
8.52 | PE | Bischof, Gleiter, et al., 1976 | Vertical value |

References

Plemenkov, Villem, et al., 1981
Plemenkov, V.V.; Villem, Y.Y.; Villem, N.V.; Bolesov, I.G.; Surmina, L.S.; Yakushkina, N.I.; Formanovskii, A.A.,
Photoelectron spectra of polyalkylcyclopropenes and polyalkylcyclopropanes,
Zh. Obshch. Khim., 1981, 51, 2076. [all data]
Bischof, Gleiter, et al., 1976
Bischof, P.; Gleiter, R.; Durr, H.; Ruge, B.; Herbst, P.,
Das Photoelektronenspektrum von 1,2-Diathylspiro[2.4]hepta-1,4,6-trien. Beispiel fur eine π-σ-*Wechselwirkung,
Chem. Ber., 1976, 109, 1412. [all data]