4-Pentyne-2-one
- Formula: C5H6O
- Molecular weight: 82.1005
- IUPAC Standard InChIKey: ASVQKRFMRKDHTD-UHFFFAOYSA-N
- CAS Registry Number: 26385-71-7
- Chemical structure:
View 3d structure (requires JavaScript / HTML 5) - Permanent link for this species. Use this link for bookmarking this species for future reference.

Gas phase ion energetics data

Data compiled by: Sharon G. Lias, John E. Bartmess, Joel F. Liebman, John L. Holmes, Rhoda D. Levin, and W. Gary Mallard
Appearance energy determinations
Ion | AE (eV) | Other Products | Method | Reference | Comment |
---|---|---|---|---|---|
C2H3O+ | 9.76 ± 0.05 | C3H3 | EI | Holmes and Lossing, 1984 |

References

Holmes and Lossing, 1984
Holmes, J.L.; Lossing, F.P.,
Heats of formation of organic radicals from appearance energies,
Int. J. Mass Spectrom. Ion Processes, 1984, 58, 113. [all data]